FreeRangeRouting Github Pull Request Testing

Build: #7238 failed Custom build by Github Hook with revision master

Build result summary

Details

Completed
Duration
92 minutes
Flags
Custom revisionCustom build
Labels
version=frr-7_1-dev-849-g58dbdd7d4git=https_//github_com/frrouting/frr_gitbuildurl=https_//ci1_netdef_org/browse/frr-frrpullreq-7238branch=master
Revision
45ec928f498430930b9696636b22056b0a673b44 45ec928f498430930b9696636b22056b0a673b44
Total tests
5304
Failing since
#7237 (Custom build by Github Hook with revision master)
Fixed in
#7240 (Custom build by Github Hook with revision master)

Tests

Custom variables

Custom revision
45ec928f498430930b9696636b22056b0a673b44 45ec928f498430930b9696636b22056b0a673b44
Name Value
github_base_sha 45ec928f498430930b9696636b22056b0a673b44
github_pullreq 3045
github_repo FRRouting/frr
github_merge_sha 58dbdd7d44349db7e69a03ac50d0f1e8dffce447
github_branch master

Comments

  1. Github Hook

    GitHub Merge Request 3045
    for GitHub Repo FRRouting/frr, branch master

    Request to merge from opensourcerouting/frr
    Merge Git Commit ID 58dbdd7d44349db7e69a03ac50d0f1e8dffce447 on top of base Git Commit ID 45ec928f498430930b9696636b22056b0a673b44

Code commits

Author Commit Message Commit date
Philippe Guibert Philippe Guibert 45ec928f498430930b9696636b22056b0a673b44 45ec928f498430930b9696636b22056b0a673b44 Merge pull request #4130 from donaldsharp/show_frr
zebra: Add hidden 'show frr' command

Tests

New test failures 46
Status Test View job Duration
Collapse Failed test_bgp_l3vpn_to_bgp_direct test_adjacencies History
Topology Tests on Ubuntu 16.04 amd64 1 min
AssertionError: 6 tests failed
E   AssertionError: 6 tests failed
Collapse Failed test_bgp_l3vpn_to_bgp_direct test_adjacencies History
Topology Tests on Ubuntu 18.04 amd64 1 min
AssertionError: 6 tests failed
E   AssertionError: 6 tests failed
Collapse Failed test_bgp_l3vpn_to_bgp_direct test_adjacencies History
TopoTest Tests on Ubuntu 16.04 i386 1 min
AssertionError: 6 tests failed
E   AssertionError: 6 tests failed
Collapse Failed test_bgp_l3vpn_to_bgp_vrf test_adjacencies History
Topology Tests on Ubuntu 16.04 amd64 6 mins
AssertionError: 8 tests failed
E   AssertionError: 8 tests failed
Collapse Failed test_bgp_l3vpn_to_bgp_vrf test_adjacencies History
Topology Tests on Ubuntu 18.04 amd64 6 mins
AssertionError: 8 tests failed
E   AssertionError: 8 tests failed
Collapse Failed test_bgp_l3vpn_to_bgp_vrf test_adjacencies History
TopoTest Tests on Ubuntu 16.04 i386 6 mins
AssertionError: 8 tests failed
E   AssertionError: 8 tests failed
Collapse Failed test_bgp_rfapi_basic_sanity_config2 test_adjacencies History
Topology Tests on Ubuntu 16.04 amd64 1 min
AssertionError: 5 tests failed
E   AssertionError: 5 tests failed
Collapse Failed test_bgp_rfapi_basic_sanity_config2 test_adjacencies History
Topology Tests on Ubuntu 18.04 amd64 1 min
AssertionError: 5 tests failed
E   AssertionError: 5 tests failed
Collapse Failed test_bgp_rfapi_basic_sanity_config2 test_adjacencies History
TopoTest Tests on Ubuntu 16.04 i386 1 min
AssertionError: 5 tests failed
E   AssertionError: 5 tests failed
Collapse Failed test_bgp_rfapi_basic_sanity test_adjacencies History
Topology Tests on Ubuntu 16.04 amd64 1 min
AssertionError: 5 tests failed
E   AssertionError: 5 tests failed
Collapse Failed test_bgp_rfapi_basic_sanity test_adjacencies History
Topology Tests on Ubuntu 18.04 amd64 1 min
AssertionError: 5 tests failed
E   AssertionError: 5 tests failed
Collapse Failed test_bgp_rfapi_basic_sanity test_adjacencies History
TopoTest Tests on Ubuntu 16.04 i386 1 min
AssertionError: 5 tests failed
E   AssertionError: 5 tests failed
Collapse Failed test_ldp_topo1 test_mpls_ldp_neighbor_establish History
Topology Tests on Ubuntu 16.04 amd64 1 min
NameError: global name 'ospfStatus' is not defined
E   NameError: global name 'ospfStatus' is not defined
Collapse Failed test_ldp_topo1 test_mpls_ldp_neighbor_establish History
Topology Tests on Ubuntu 18.04 amd64 1 min
NameError: global name 'ospfStatus' is not defined
E   NameError: global name 'ospfStatus' is not defined
Collapse Failed test_ldp_topo1 test_mpls_ldp_neighbor_establish History
TopoTest Tests on Ubuntu 16.04 i386 1 min
NameError: global name 'ospfStatus' is not defined
E   NameError: global name 'ospfStatus' is not defined
Collapse Failed test_ldp_vpls_topo1 test_ldp_neighbors History
Topology Tests on Ubuntu 16.04 amd64 1 min
AssertionError: "r1" JSON output mismatches the expected result assert json too few items (have 1, expected 2:    --- Expected value   +++ Current value   @@ -6,7 +6,2 @@   -        "transportAddress": "2.2.2.2"   -    },    -    {   -        "addressFamily": "ipv4",    -        "neighborId": "3.3.3.3",    -        "state": "OPERATIONAL",    -        "transportAddress": "3.3.3.3"   +        "transportAddress": "2.2.2.2",    +        "upTime": "00:03:32")
E   AssertionError: "r1" JSON output mismatches the expected result
    assert json too few items (have 1, expected 2:
       --- Expected value
      +++ Current value
      @@ -6,7 +6,2 @@
      -        "transportAddress": "2.2.2.2"
      -    }, 
(7 more lines...)
Collapse Failed test_ldp_vpls_topo1 test_rib History
Topology Tests on Ubuntu 16.04 amd64 1 min
AssertionError: "r1" JSON output mismatches the expected result assert json value is different (   --- Expected value   +++ Current value   @@ -4 +4,3 @@   -        "metric": 10,    +        "internalFlags": 0,    +        "internalStatus": 2,    +        "metric": 30,    @@ -8,3 +10,5 @@   -                "directlyConnected": true,    -                "interfaceIndex": 4,    -                "interfaceName": "r1-eth2"   +                "afi": "ipv4",    +                "flags": 1,    +                "interfaceIndex": 3,    +                "interfaceName": "r1-eth1",    +                "ip": "10.0.1.2"   @@ -14 +18,2 @@   -        "protocol": "ospf"   +        "protocol": "ospf",    +        "uptime": "00:01:42"   @@ -16,0 +22,6 @@   +        "destSelected": true,    +        "distance": 0,    +        "installed": true,    +        "internalFlags": 8,    +        "internalStatus": 32,    +        "metric": 0,    @@ -21,0 +33 @@   +                "flags": 3,    @@ -28 +40,2 @@   -        "selected": true   +        "selected": true,    +        "uptime": "00:02:36")   json value is different (   --- Expected value   +++ Current value   @@ -2,0 +3 @@   +        "destSelected": true,    @@ -4 +5,4 @@   -        "metric": 10,    +        "installed": true,    +        "internalFlags": 8,    +        "internalStatus": 40,    +        "metric": 20,    @@ -10,3 +14,7 @@   -                "interfaceIndex": 4,    -                "interfaceName": "r1-eth2",    -                "ip": "10.0.2.3"   +                "flags": 3,    +                "interfaceIndex": 3,    +                "interfaceName": "r1-eth1",    +                "ip": "10.0.1.2",    +                "labels": [   +                    18   +                ]   @@ -17 +25,2 @@   -        "selected": true   +        "selected": true,    +        "uptime": "00:01:42")   json value is different (   --- Expected value   +++ Current value   @@ -2,0 +3 @@   +        "destSelected": true,    @@ -3,0 +5,3 @@   +        "installed": true,    +        "internalFlags": 8,    +        "internalStatus": 34,    @@ -9,0 +14 @@   +                "flags": 3,    @@ -13,8 +17,0 @@   -            },    -            {   -                "active": true,    -                "afi": "ipv4",    -                "fib": true,    -                "interfaceIndex": 4,    -                "interfaceName": "r1-eth2",    -                "ip": "10.0.2.3"   @@ -25 +22,2 @@   -        "selected": true   +        "selected": true,    +        "uptime": "00:01:52")
E   AssertionError: "r1" JSON output mismatches the expected result
    assert json value is different (
      --- Expected value
      +++ Current value
      @@ -4 +4,3 @@
      -        "metric": 10, 
      +        "internalFlags": 0, 
(78 more lines...)
Collapse Failed test_ldp_vpls_topo1 test_ldp_bindings History
Topology Tests on Ubuntu 16.04 amd64 1 min
AssertionError: "r1" JSON output mismatches the expected result assert json too few items (have 3, expected 6:    --- Expected value   +++ Current value   @@ -7,8 +7,2 @@   -        "prefix": "1.1.1.1/32"   -    },    -    {   -        "addressFamily": "ipv4",    -        "inUse": 0,    -        "localLabel": "imp-null",    -        "neighborId": "3.3.3.3",    -        "prefix": "1.1.1.1/32"   +        "prefix": "1.1.1.1/32",    +        "remoteLabel": "17"   @@ -18,0 +13 @@   +        "localLabel": "17",    @@ -25,7 +20,2 @@   -        "inUse": 0,    -        "neighborId": "3.3.3.3",    -        "prefix": "2.2.2.2/32"   -    },    -    {   -        "addressFamily": "ipv4",    -        "inUse": 0,    +        "inUse": 1,    +        "localLabel": "18",    @@ -33,6 +22,0 @@   -        "prefix": "3.3.3.3/32"   -    },    -    {   -        "addressFamily": "ipv4",    -        "inUse": 1,    -        "neighborId": "3.3.3.3",    @@ -40 +24 @@   -        "remoteLabel": "imp-null"   +        "remoteLabel": "18")
E   AssertionError: "r1" JSON output mismatches the expected result
    assert json too few items (have 3, expected 6:
       --- Expected value
      +++ Current value
      @@ -7,8 +7,2 @@
      -        "prefix": "1.1.1.1/32"
      -    }, 
(30 more lines...)
Collapse Failed test_ldp_vpls_topo1 test_rib History
Topology Tests on Ubuntu 18.04 amd64 1 min
AssertionError: "r1" JSON output mismatches the expected result assert json value is different (   --- Expected value   +++ Current value   @@ -4 +4,3 @@   -        "metric": 10,    +        "internalFlags": 0,    +        "internalStatus": 2,    +        "metric": 30,    @@ -8,3 +10,5 @@   -                "directlyConnected": true,    -                "interfaceIndex": 4,    -                "interfaceName": "r1-eth2"   +                "afi": "ipv4",    +                "flags": 1,    +                "interfaceIndex": 3,    +                "interfaceName": "r1-eth1",    +                "ip": "10.0.1.2"   @@ -14 +18,2 @@   -        "protocol": "ospf"   +        "protocol": "ospf",    +        "uptime": "00:01:52"   @@ -16,0 +22,6 @@   +        "destSelected": true,    +        "distance": 0,    +        "installed": true,    +        "internalFlags": 8,    +        "internalStatus": 32,    +        "metric": 0,    @@ -21,0 +33 @@   +                "flags": 3,    @@ -28 +40,2 @@   -        "selected": true   +        "selected": true,    +        "uptime": "00:02:41")   json value is different (   --- Expected value   +++ Current value   @@ -2,0 +3 @@   +        "destSelected": true,    @@ -4 +5,4 @@   -        "metric": 10,    +        "installed": true,    +        "internalFlags": 8,    +        "internalStatus": 40,    +        "metric": 20,    @@ -10,3 +14,7 @@   -                "interfaceIndex": 4,    -                "interfaceName": "r1-eth2",    -                "ip": "10.0.2.3"   +                "flags": 3,    +                "interfaceIndex": 3,    +                "interfaceName": "r1-eth1",    +                "ip": "10.0.1.2",    +                "labels": [   +                    18   +                ]   @@ -17 +25,2 @@   -        "selected": true   +        "selected": true,    +        "uptime": "00:01:52")   json value is different (   --- Expected value   +++ Current value   @@ -2,0 +3 @@   +        "destSelected": true,    @@ -3,0 +5,3 @@   +        "installed": true,    +        "internalFlags": 8,    +        "internalStatus": 34,    @@ -9,0 +14 @@   +                "flags": 3,    @@ -13,8 +17,0 @@   -            },    -            {   -                "active": true,    -                "afi": "ipv4",    -                "fib": true,    -                "interfaceIndex": 4,    -                "interfaceName": "r1-eth2",    -                "ip": "10.0.2.3"   @@ -25 +22,2 @@   -        "selected": true   +        "selected": true,    +        "uptime": "00:01:57")
E   AssertionError: "r1" JSON output mismatches the expected result
    assert json value is different (
      --- Expected value
      +++ Current value
      @@ -4 +4,3 @@
      -        "metric": 10, 
      +        "internalFlags": 0, 
(78 more lines...)
Collapse Failed test_ldp_vpls_topo1 test_ldp_neighbors History
Topology Tests on Ubuntu 18.04 amd64 1 min
AssertionError: "r1" JSON output mismatches the expected result assert json too few items (have 1, expected 2:    --- Expected value   +++ Current value   @@ -6,7 +6,2 @@   -        "transportAddress": "2.2.2.2"   -    },    -    {   -        "addressFamily": "ipv4",    -        "neighborId": "3.3.3.3",    -        "state": "OPERATIONAL",    -        "transportAddress": "3.3.3.3"   +        "transportAddress": "2.2.2.2",    +        "upTime": "00:03:38")
E   AssertionError: "r1" JSON output mismatches the expected result
    assert json too few items (have 1, expected 2:
       --- Expected value
      +++ Current value
      @@ -6,7 +6,2 @@
      -        "transportAddress": "2.2.2.2"
      -    }, 
(7 more lines...)
Collapse Failed test_ldp_vpls_topo1 test_ldp_bindings History
Topology Tests on Ubuntu 18.04 amd64 1 min
AssertionError: "r1" JSON output mismatches the expected result assert json too few items (have 3, expected 6:    --- Expected value   +++ Current value   @@ -7,8 +7,2 @@   -        "prefix": "1.1.1.1/32"   -    },    -    {   -        "addressFamily": "ipv4",    -        "inUse": 0,    -        "localLabel": "imp-null",    -        "neighborId": "3.3.3.3",    -        "prefix": "1.1.1.1/32"   +        "prefix": "1.1.1.1/32",    +        "remoteLabel": "17"   @@ -18,0 +13 @@   +        "localLabel": "17",    @@ -25,7 +20,2 @@   -        "inUse": 0,    -        "neighborId": "3.3.3.3",    -        "prefix": "2.2.2.2/32"   -    },    -    {   -        "addressFamily": "ipv4",    -        "inUse": 0,    +        "inUse": 1,    +        "localLabel": "18",    @@ -33,6 +22,0 @@   -        "prefix": "3.3.3.3/32"   -    },    -    {   -        "addressFamily": "ipv4",    -        "inUse": 1,    -        "neighborId": "3.3.3.3",    @@ -40 +24 @@   -        "remoteLabel": "imp-null"   +        "remoteLabel": "18")
E   AssertionError: "r1" JSON output mismatches the expected result
    assert json too few items (have 3, expected 6:
       --- Expected value
      +++ Current value
      @@ -7,8 +7,2 @@
      -        "prefix": "1.1.1.1/32"
      -    }, 
(30 more lines...)
Collapse Failed test_ldp_vpls_topo1 test_ldp_bindings History
TopoTest Tests on Ubuntu 16.04 i386 1 min
AssertionError: "r1" JSON output mismatches the expected result assert json too few items (have 3, expected 6:    --- Expected value   +++ Current value   @@ -7,8 +7,2 @@   -        "prefix": "1.1.1.1/32"   -    },    -    {   -        "addressFamily": "ipv4",    -        "inUse": 0,    -        "localLabel": "imp-null",    -        "neighborId": "3.3.3.3",    -        "prefix": "1.1.1.1/32"   +        "prefix": "1.1.1.1/32",    +        "remoteLabel": "17"   @@ -18,0 +13 @@   +        "localLabel": "17",    @@ -25,7 +20,2 @@   -        "inUse": 0,    -        "neighborId": "3.3.3.3",    -        "prefix": "2.2.2.2/32"   -    },    -    {   -        "addressFamily": "ipv4",    -        "inUse": 0,    +        "inUse": 1,    +        "localLabel": "18",    @@ -33,6 +22,0 @@   -        "prefix": "3.3.3.3/32"   -    },    -    {   -        "addressFamily": "ipv4",    -        "inUse": 1,    -        "neighborId": "3.3.3.3",    @@ -40 +24 @@   -        "remoteLabel": "imp-null"   +        "remoteLabel": "18")
E   AssertionError: "r1" JSON output mismatches the expected result
    assert json too few items (have 3, expected 6:
       --- Expected value
      +++ Current value
      @@ -7,8 +7,2 @@
      -        "prefix": "1.1.1.1/32"
      -    }, 
(30 more lines...)
Collapse Failed test_ldp_vpls_topo1 test_rib History
TopoTest Tests on Ubuntu 16.04 i386 1 min
AssertionError: "r1" JSON output mismatches the expected result assert json value is different (   --- Expected value   +++ Current value   @@ -4 +4,3 @@   -        "metric": 10,    +        "internalFlags": 0,    +        "internalStatus": 2,    +        "metric": 30,    @@ -8,3 +10,5 @@   -                "directlyConnected": true,    -                "interfaceIndex": 4,    -                "interfaceName": "r1-eth2"   +                "afi": "ipv4",    +                "flags": 1,    +                "interfaceIndex": 3,    +                "interfaceName": "r1-eth1",    +                "ip": "10.0.1.2"   @@ -14 +18,2 @@   -        "protocol": "ospf"   +        "protocol": "ospf",    +        "uptime": "00:01:55"   @@ -16,0 +22,6 @@   +        "destSelected": true,    +        "distance": 0,    +        "installed": true,    +        "internalFlags": 8,    +        "internalStatus": 32,    +        "metric": 0,    @@ -21,0 +33 @@   +                "flags": 3,    @@ -28 +40,2 @@   -        "selected": true   +        "selected": true,    +        "uptime": "00:02:45")   json value is different (   --- Expected value   +++ Current value   @@ -2,0 +3 @@   +        "destSelected": true,    @@ -4 +5,4 @@   -        "metric": 10,    +        "installed": true,    +        "internalFlags": 8,    +        "internalStatus": 40,    +        "metric": 20,    @@ -10,3 +14,7 @@   -                "interfaceIndex": 4,    -                "interfaceName": "r1-eth2",    -                "ip": "10.0.2.3"   +                "flags": 3,    +                "interfaceIndex": 3,    +                "interfaceName": "r1-eth1",    +                "ip": "10.0.1.2",    +                "labels": [   +                    18   +                ]   @@ -17 +25,2 @@   -        "selected": true   +        "selected": true,    +        "uptime": "00:01:55")   json value is different (   --- Expected value   +++ Current value   @@ -2,0 +3 @@   +        "destSelected": true,    @@ -3,0 +5,3 @@   +        "installed": true,    +        "internalFlags": 8,    +        "internalStatus": 34,    @@ -9,0 +14 @@   +                "flags": 3,    @@ -13,8 +17,0 @@   -            },    -            {   -                "active": true,    -                "afi": "ipv4",    -                "fib": true,    -                "interfaceIndex": 4,    -                "interfaceName": "r1-eth2",    -                "ip": "10.0.2.3"   @@ -25 +22,2 @@   -        "selected": true   +        "selected": true,    +        "uptime": "00:02:00")
E   AssertionError: "r1" JSON output mismatches the expected result
    assert json value is different (
      --- Expected value
      +++ Current value
      @@ -4 +4,3 @@
      -        "metric": 10, 
      +        "internalFlags": 0, 
(78 more lines...)
Collapse Failed test_ldp_vpls_topo1 test_ldp_neighbors History
TopoTest Tests on Ubuntu 16.04 i386 1 min
AssertionError: "r1" JSON output mismatches the expected result assert json too few items (have 1, expected 2:    --- Expected value   +++ Current value   @@ -6,7 +6,2 @@   -        "transportAddress": "2.2.2.2"   -    },    -    {   -        "addressFamily": "ipv4",    -        "neighborId": "3.3.3.3",    -        "state": "OPERATIONAL",    -        "transportAddress": "3.3.3.3"   +        "transportAddress": "2.2.2.2",    +        "upTime": "00:03:42")
E   AssertionError: "r1" JSON output mismatches the expected result
    assert json too few items (have 1, expected 2:
       --- Expected value
      +++ Current value
      @@ -6,7 +6,2 @@
      -        "transportAddress": "2.2.2.2"
      -    }, 
(7 more lines...)
Collapse Failed test_lm-proxy-topo1 test_lm_proxy History
Topology Tests on Ubuntu 18.04 amd64 3 mins
AssertionError: wrong labels assert False
E   AssertionError: wrong labels
    assert False
Collapse Failed test_ospf_sr_topo1 test_ospf_kernel_route History
Topology Tests on Ubuntu 16.04 amd64 1 min
AssertionError: OSPF did not properly instal MPLS table on r1:   --- Current output   +++ Expected output   @@ -38,6 +38,19 @@          }        ]      },   +  "20400":{   +    "inLabel":20400,   +    "installed":true,   +    "nexthops":[   +      {   +        "type":"SR",   +        "outLabel":8400,   +        "distance":150,   +        "installed":true,   +        "nexthop":"10.0.1.2"   +      }   +    ]   +  },      "50000":{        "inLabel":50000,        "installed":true, assert False
E   AssertionError: OSPF did not properly instal MPLS table on r1:
      --- Current output
      +++ Expected output
      @@ -38,6 +38,19 @@
             }
           ]
         },
(17 more lines...)
Collapse Failed test_ospf_sr_topo1 test_ospf_sr History
Topology Tests on Ubuntu 16.04 amd64 1 min
AssertionError: OSPF did not start Segment Routing on r1:   --- Current output   +++ Expected output   @@ -35,10 +35,10 @@            {              "prefix":"10.0.255.4\/32",              "sid":400,   -          "inputLabel":0,   -          "outputLabel":"0",   -          "interface":"-",   -          "nexthop":"0.0.0.0"   +          "inputLabel":20400,   +          "outputLabel":"8400",   +          "interface":"r1-eth0",   +          "nexthop":"10.0.1.2"            }          ]        }, assert False
E   AssertionError: OSPF did not start Segment Routing on r1:
      --- Current output
      +++ Expected output
      @@ -35,10 +35,10 @@
               {
                 "prefix":"10.0.255.4\/32",
                 "sid":400,
(12 more lines...)
Collapse Failed test_ospf_sr_topo1 test_ospf_sr History
Topology Tests on Ubuntu 18.04 amd64 1 min
AssertionError: OSPF did not start Segment Routing on r1:   --- Current output   +++ Expected output   @@ -35,10 +35,10 @@            {              "prefix":"10.0.255.4\/32",              "sid":400,   -          "inputLabel":0,   -          "outputLabel":"0",   -          "interface":"-",   -          "nexthop":"0.0.0.0"   +          "inputLabel":20400,   +          "outputLabel":"8400",   +          "interface":"r1-eth0",   +          "nexthop":"10.0.1.2"            }          ]        }, assert False
E   AssertionError: OSPF did not start Segment Routing on r1:
      --- Current output
      +++ Expected output
      @@ -35,10 +35,10 @@
               {
                 "prefix":"10.0.255.4\/32",
                 "sid":400,
(12 more lines...)
Collapse Failed test_ospf_sr_topo1 test_ospf_kernel_route History
Topology Tests on Ubuntu 18.04 amd64 1 min
AssertionError: OSPF did not properly instal MPLS table on r1:   --- Current output   +++ Expected output   @@ -38,6 +38,19 @@          }        ]      },   +  "20400":{   +    "inLabel":20400,   +    "installed":true,   +    "nexthops":[   +      {   +        "type":"SR",   +        "outLabel":8400,   +        "distance":150,   +        "installed":true,   +        "nexthop":"10.0.1.2"   +      }   +    ]   +  },      "50000":{        "inLabel":50000,        "installed":true, assert False
E   AssertionError: OSPF did not properly instal MPLS table on r1:
      --- Current output
      +++ Expected output
      @@ -38,6 +38,19 @@
             }
           ]
         },
(17 more lines...)
Collapse Failed test_ospf_sr_topo1 test_ospf_kernel_route History
TopoTest Tests on Ubuntu 16.04 i386 1 min
AssertionError: OSPF did not properly instal MPLS table on r1:   --- Current output   +++ Expected output   @@ -38,6 +38,19 @@          }        ]      },   +  "20400":{   +    "inLabel":20400,   +    "installed":true,   +    "nexthops":[   +      {   +        "type":"SR",   +        "outLabel":8400,   +        "distance":150,   +        "installed":true,   +        "nexthop":"10.0.1.2"   +      }   +    ]   +  },      "50000":{        "inLabel":50000,        "installed":true, assert False
E   AssertionError: OSPF did not properly instal MPLS table on r1:
      --- Current output
      +++ Expected output
      @@ -38,6 +38,19 @@
             }
           ]
         },
(17 more lines...)
Collapse Failed test_ospf_sr_topo1 test_ospf_sr History
TopoTest Tests on Ubuntu 16.04 i386 1 min
AssertionError: OSPF did not start Segment Routing on r1:   --- Current output   +++ Expected output   @@ -35,10 +35,10 @@            {              "prefix":"10.0.255.4\/32",              "sid":400,   -          "inputLabel":0,   -          "outputLabel":"0",   -          "interface":"-",   -          "nexthop":"0.0.0.0"   +          "inputLabel":20400,   +          "outputLabel":"8400",   +          "interface":"r1-eth0",   +          "nexthop":"10.0.1.2"            }          ]        }, assert False
E   AssertionError: OSPF did not start Segment Routing on r1:
      --- Current output
      +++ Expected output
      @@ -35,10 +35,10 @@
               {
                 "prefix":"10.0.255.4\/32",
                 "sid":400,
(12 more lines...)
Collapse Failed test_ospf_topo1 test_ospf_convergence History
Topology Tests on Ubuntu 16.04 amd64 2 mins
AssertionError: OSPF did not converge on r1:   --- Current output   +++ Expected output   @@ -1,6 +1,8 @@    ============ OSPF network routing table ============    N 10.0.1.0/24 [10] area: 0.0.0.0     directly attached to r1-eth0   +N 10.0.2.0/24 [20] area: 0.0.0.0   + via 10.0.3.3, r1-eth1    N 10.0.3.0/24 [10] area: 0.0.0.0     directly attached to r1-eth1    N 10.0.10.0/24 [20] area: 0.0.0.0   @@ -11,6 +13,8 @@     via 10.0.3.1, r1-eth1        ============ OSPF router routing table =============   +R 10.0.255.2 [10] area: 0.0.0.0, ASBR   + via 10.0.3.3, r1-eth1    R 10.0.255.3 [10] area: 0.0.0.0, ABR, ASBR     via 10.0.3.1, r1-eth1    R 10.0.255.4 IA [20] area: 0.0.0.0, ASBR assert False
E   AssertionError: OSPF did not converge on r1:
      --- Current output
      +++ Expected output
      @@ -1,6 +1,8 @@
       ============ OSPF network routing table ============
       N 10.0.1.0/24 [10] area: 0.0.0.0
        directly attached to r1-eth0
(15 more lines...)
Collapse Failed test_ospf_topo1 test_ospf_kernel_route History
Topology Tests on Ubuntu 16.04 amd64 < 1 sec
AssertionError: OSPF IPv4 route mismatch in router "r4" assert expected key(s) ['10.0.2.0/24'] in json (have ['172.16.1.0/24', '10.0.10.0/24', '10.0.1.0/24', '172.16.0.0/24', '10.0.3.0/24']):   --- Expected value   +++ Current value   @@ -2,6 +2,28 @@   -    "10.0.1.0/24": {},    -    "10.0.10.0/24": {},    -    "10.0.2.0/24": {},    -    "10.0.3.0/24": {},    -    "172.16.0.0/24": {},    -    "172.16.1.0/24": {}   +    "10.0.1.0/24": {   +        "dev": "r4-eth0",    +        "metric": "20",    +        "proto": "188",    +        "via": "172.16.0.2"   +    },    +    "10.0.10.0/24": {   +        "dev": "r4-eth0",    +        "metric": "20",    +        "proto": "188",    +        "via": "172.16.0.2"   +    },    +    "10.0.3.0/24": {   +        "dev": "r4-eth0",    +        "metric": "20",    +        "proto": "188",    +        "via": "172.16.0.2"   +    },    +    "172.16.0.0/24": {   +        "dev": "r4-eth0",    +        "proto": "kernel",    +        "scope": "link"   +    },    +    "172.16.1.0/24": {   +        "dev": "r4-eth1",    +        "proto": "kernel",    +        "scope": "link"   +    }
E   AssertionError: OSPF IPv4 route mismatch in router "r4"
    assert expected key(s) ['10.0.2.0/24'] in json (have ['172.16.1.0/24', '10.0.10.0/24', '10.0.1.0/24', '172.16.0.0/24', '10.0.3.0/24']):
      --- Expected value
      +++ Current value
      @@ -2,6 +2,28 @@
      -    "10.0.1.0/24": {}, 
      -    "10.0.10.0/24": {}, 
(32 more lines...)
Collapse Failed test_ospf_topo1 test_ospf_json History
Topology Tests on Ubuntu 16.04 amd64 < 1 sec
AssertionError: "r3" JSON output mismatches the expected result assert json["areas"]["0.0.0.1"]["lsaNumber"] value is different (   --- Expected value   +++ Current value   @@ -1 +1 @@   -9   +7)   json["areas"]["0.0.0.1"]["lsaSummaryNumber"] value is different (   --- Expected value   +++ Current value   @@ -1 +1 @@   -4   +3)   json["areas"]["0.0.0.1"]["lsaAsbrNumber"] value is different (   --- Expected value   +++ Current value   @@ -1 +1 @@   -2   +1)
E   AssertionError: "r3" JSON output mismatches the expected result
    assert json["areas"]["0.0.0.1"]["lsaNumber"] value is different (
      --- Expected value
      +++ Current value
      @@ -1 +1 @@
      -9
      +7)
(12 more lines...)
Collapse Failed test_ospf_topo1 test_ospf_json History
Topology Tests on Ubuntu 18.04 amd64 < 1 sec
AssertionError: "r3" JSON output mismatches the expected result assert json["areas"]["0.0.0.1"]["lsaNumber"] value is different (   --- Expected value   +++ Current value   @@ -1 +1 @@   -9   +7)   json["areas"]["0.0.0.1"]["lsaSummaryNumber"] value is different (   --- Expected value   +++ Current value   @@ -1 +1 @@   -4   +3)   json["areas"]["0.0.0.1"]["lsaAsbrNumber"] value is different (   --- Expected value   +++ Current value   @@ -1 +1 @@   -2   +1)
E   AssertionError: "r3" JSON output mismatches the expected result
    assert json["areas"]["0.0.0.1"]["lsaNumber"] value is different (
      --- Expected value
      +++ Current value
      @@ -1 +1 @@
      -9
      +7)
(12 more lines...)
Collapse Failed test_ospf_topo1 test_ospf_convergence History
Topology Tests on Ubuntu 18.04 amd64 1 min
AssertionError: OSPF did not converge on r4:   --- Current output   +++ Expected output   @@ -1,5 +1,7 @@    ============ OSPF network routing table ============    N IA 10.0.1.0/24 [30] area: 0.0.0.1   + via 172.16.0.2, r4-eth0   +N IA 10.0.2.0/24 [30] area: 0.0.0.1     via 172.16.0.2, r4-eth0    N IA 10.0.3.0/24 [20] area: 0.0.0.1     via 172.16.0.2, r4-eth0   @@ -13,6 +15,8 @@    ============ OSPF router routing table =============    R 10.0.255.1 IA [20] area: 0.0.0.1, ASBR     via 172.16.0.2, r4-eth0   +R 10.0.255.2 IA [20] area: 0.0.0.1, ASBR   + via 172.16.0.2, r4-eth0    R 10.0.255.3 [10] area: 0.0.0.1, ABR, ASBR     via 172.16.0.2, r4-eth0     assert False
E   AssertionError: OSPF did not converge on r4:
      --- Current output
      +++ Expected output
      @@ -1,5 +1,7 @@
       ============ OSPF network routing table ============
       N IA 10.0.1.0/24 [30] area: 0.0.0.1
      + via 172.16.0.2, r4-eth0
(14 more lines...)
Collapse Failed test_ospf_topo1 test_ospf_kernel_route History
Topology Tests on Ubuntu 18.04 amd64 < 1 sec
AssertionError: OSPF IPv4 route mismatch in router "r4" assert expected key(s) ['10.0.2.0/24'] in json (have ['172.16.1.0/24', '10.0.10.0/24', '10.0.1.0/24', '172.16.0.0/24', '10.0.3.0/24']):   --- Expected value   +++ Current value   @@ -2,6 +2,28 @@   -    "10.0.1.0/24": {},    -    "10.0.10.0/24": {},    -    "10.0.2.0/24": {},    -    "10.0.3.0/24": {},    -    "172.16.0.0/24": {},    -    "172.16.1.0/24": {}   +    "10.0.1.0/24": {   +        "dev": "r4-eth0",    +        "metric": "20",    +        "proto": "188",    +        "via": "172.16.0.2"   +    },    +    "10.0.10.0/24": {   +        "dev": "r4-eth0",    +        "metric": "20",    +        "proto": "188",    +        "via": "172.16.0.2"   +    },    +    "10.0.3.0/24": {   +        "dev": "r4-eth0",    +        "metric": "20",    +        "proto": "188",    +        "via": "172.16.0.2"   +    },    +    "172.16.0.0/24": {   +        "dev": "r4-eth0",    +        "proto": "kernel",    +        "scope": "link"   +    },    +    "172.16.1.0/24": {   +        "dev": "r4-eth1",    +        "proto": "kernel",    +        "scope": "link"   +    }
E   AssertionError: OSPF IPv4 route mismatch in router "r4"
    assert expected key(s) ['10.0.2.0/24'] in json (have ['172.16.1.0/24', '10.0.10.0/24', '10.0.1.0/24', '172.16.0.0/24', '10.0.3.0/24']):
      --- Expected value
      +++ Current value
      @@ -2,6 +2,28 @@
      -    "10.0.1.0/24": {}, 
      -    "10.0.10.0/24": {}, 
(32 more lines...)
Collapse Failed test_ospf_topo1 test_ospf_convergence History
TopoTest Tests on Ubuntu 16.04 i386 1 min
AssertionError: OSPF did not converge on r4:   --- Current output   +++ Expected output   @@ -1,5 +1,7 @@    ============ OSPF network routing table ============    N IA 10.0.1.0/24 [30] area: 0.0.0.1   + via 172.16.0.2, r4-eth0   +N IA 10.0.2.0/24 [30] area: 0.0.0.1     via 172.16.0.2, r4-eth0    N IA 10.0.3.0/24 [20] area: 0.0.0.1     via 172.16.0.2, r4-eth0   @@ -13,6 +15,8 @@    ============ OSPF router routing table =============    R 10.0.255.1 IA [20] area: 0.0.0.1, ASBR     via 172.16.0.2, r4-eth0   +R 10.0.255.2 IA [20] area: 0.0.0.1, ASBR   + via 172.16.0.2, r4-eth0    R 10.0.255.3 [10] area: 0.0.0.1, ABR, ASBR     via 172.16.0.2, r4-eth0     assert False
E   AssertionError: OSPF did not converge on r4:
      --- Current output
      +++ Expected output
      @@ -1,5 +1,7 @@
       ============ OSPF network routing table ============
       N IA 10.0.1.0/24 [30] area: 0.0.0.1
      + via 172.16.0.2, r4-eth0
(14 more lines...)
Collapse Failed test_ospf_topo1 test_ospf_kernel_route History
TopoTest Tests on Ubuntu 16.04 i386 < 1 sec
AssertionError: OSPF IPv4 route mismatch in router "r4" assert expected key(s) ['10.0.2.0/24'] in json (have ['172.16.1.0/24', '10.0.10.0/24', '10.0.1.0/24', '172.16.0.0/24', '10.0.3.0/24']):   --- Expected value   +++ Current value   @@ -2,6 +2,28 @@   -    "10.0.1.0/24": {},    -    "10.0.10.0/24": {},    -    "10.0.2.0/24": {},    -    "10.0.3.0/24": {},    -    "172.16.0.0/24": {},    -    "172.16.1.0/24": {}   +    "10.0.1.0/24": {   +        "dev": "r4-eth0",    +        "metric": "20",    +        "proto": "188",    +        "via": "172.16.0.2"   +    },    +    "10.0.10.0/24": {   +        "dev": "r4-eth0",    +        "metric": "20",    +        "proto": "188",    +        "via": "172.16.0.2"   +    },    +    "10.0.3.0/24": {   +        "dev": "r4-eth0",    +        "metric": "20",    +        "proto": "188",    +        "via": "172.16.0.2"   +    },    +    "172.16.0.0/24": {   +        "dev": "r4-eth0",    +        "proto": "kernel",    +        "scope": "link"   +    },    +    "172.16.1.0/24": {   +        "dev": "r4-eth1",    +        "proto": "kernel",    +        "scope": "link"   +    }
E   AssertionError: OSPF IPv4 route mismatch in router "r4"
    assert expected key(s) ['10.0.2.0/24'] in json (have ['172.16.1.0/24', '10.0.10.0/24', '10.0.1.0/24', '172.16.0.0/24', '10.0.3.0/24']):
      --- Expected value
      +++ Current value
      @@ -2,6 +2,28 @@
      -    "10.0.1.0/24": {}, 
      -    "10.0.10.0/24": {}, 
(32 more lines...)
Collapse Failed test_ospf_topo1 test_ospf_json History
TopoTest Tests on Ubuntu 16.04 i386 < 1 sec
AssertionError: "r3" JSON output mismatches the expected result assert json["areas"]["0.0.0.1"]["lsaNumber"] value is different (   --- Expected value   +++ Current value   @@ -1 +1 @@   -9   +7)   json["areas"]["0.0.0.1"]["lsaSummaryNumber"] value is different (   --- Expected value   +++ Current value   @@ -1 +1 @@   -4   +3)   json["areas"]["0.0.0.1"]["lsaAsbrNumber"] value is different (   --- Expected value   +++ Current value   @@ -1 +1 @@   -2   +1)
E   AssertionError: "r3" JSON output mismatches the expected result
    assert json["areas"]["0.0.0.1"]["lsaNumber"] value is different (
      --- Expected value
      +++ Current value
      @@ -1 +1 @@
      -9
      +7)
(12 more lines...)
Collapse Failed test_ospf_topo1_vrf test_ospf_convergence History
Topology Tests on Ubuntu 16.04 amd64 1 min
AssertionError: OSPF did not converge on r1:   --- Current output   +++ Expected output   @@ -2,12 +2,16 @@    ============ OSPF network routing table ============    N 10.0.1.0/24 [10] area: 0.0.0.0     directly attached to r1-eth0   +N 10.0.2.0/24 [20] area: 0.0.0.0   + via 10.0.3.3, r1-eth1    N 10.0.3.0/24 [10] area: 0.0.0.0     directly attached to r1-eth1    N 10.0.10.0/24 [20] area: 0.0.0.0     via 10.0.3.1, r1-eth1        ============ OSPF router routing table =============   +R 10.0.255.2 [10] area: 0.0.0.0, ASBR   + via 10.0.3.3, r1-eth1    R 10.0.255.3 [10] area: 0.0.0.0, ASBR     via 10.0.3.1, r1-eth1     assert False
E   AssertionError: OSPF did not converge on r1:
      --- Current output
      +++ Expected output
      @@ -2,12 +2,16 @@
       ============ OSPF network routing table ============
       N 10.0.1.0/24 [10] area: 0.0.0.0
        directly attached to r1-eth0
(14 more lines...)
Collapse Failed test_ospf_topo1_vrf test_ospf_kernel_route History
Topology Tests on Ubuntu 16.04 amd64 1 min
AssertionError: OSPF IPv4 route mismatch in router "r1": --- Current output   +++ Expected output   @@ -1,6 +1,7 @@    VRF r1-cust1:    O   10.0.1.0/24 [110/10] is directly connected, r1-eth0, XX:XX:XX    C>* 10.0.1.0/24 is directly connected, r1-eth0, XX:XX:XX   +O>* 10.0.2.0/24 [110/20] via 10.0.3.3, r1-eth1, XX:XX:XX    O   10.0.3.0/24 [110/10] is directly connected, r1-eth1, XX:XX:XX    C>* 10.0.3.0/24 is directly connected, r1-eth1, XX:XX:XX    O>* 10.0.10.0/24 [110/20] via 10.0.3.1, r1-eth1, XX:XX:XX assert False
E   AssertionError: OSPF IPv4 route mismatch in router "r1": --- Current output
      +++ Expected output
      @@ -1,6 +1,7 @@
       VRF r1-cust1:
       O   10.0.1.0/24 [110/10] is directly connected, r1-eth0, XX:XX:XX
       C>* 10.0.1.0/24 is directly connected, r1-eth0, XX:XX:XX
      +O>* 10.0.2.0/24 [110/20] via 10.0.3.3, r1-eth1, XX:XX:XX
(4 more lines...)
Collapse Failed test_ospf_topo1_vrf test_ospf_kernel_route History
Topology Tests on Ubuntu 18.04 amd64 1 min
AssertionError: OSPF IPv4 route mismatch in router "r1": --- Current output   +++ Expected output   @@ -1,6 +1,7 @@    VRF r1-cust1:    O   10.0.1.0/24 [110/10] is directly connected, r1-eth0, XX:XX:XX    C>* 10.0.1.0/24 is directly connected, r1-eth0, XX:XX:XX   +O>* 10.0.2.0/24 [110/20] via 10.0.3.3, r1-eth1, XX:XX:XX    O   10.0.3.0/24 [110/10] is directly connected, r1-eth1, XX:XX:XX    C>* 10.0.3.0/24 is directly connected, r1-eth1, XX:XX:XX    O>* 10.0.10.0/24 [110/20] via 10.0.3.1, r1-eth1, XX:XX:XX assert False
E   AssertionError: OSPF IPv4 route mismatch in router "r1": --- Current output
      +++ Expected output
      @@ -1,6 +1,7 @@
       VRF r1-cust1:
       O   10.0.1.0/24 [110/10] is directly connected, r1-eth0, XX:XX:XX
       C>* 10.0.1.0/24 is directly connected, r1-eth0, XX:XX:XX
      +O>* 10.0.2.0/24 [110/20] via 10.0.3.3, r1-eth1, XX:XX:XX
(4 more lines...)
Collapse Failed test_ospf_topo1_vrf test_ospf_convergence History
Topology Tests on Ubuntu 18.04 amd64 1 min
AssertionError: OSPF did not converge on r1:   --- Current output   +++ Expected output   @@ -2,12 +2,16 @@    ============ OSPF network routing table ============    N 10.0.1.0/24 [10] area: 0.0.0.0     directly attached to r1-eth0   +N 10.0.2.0/24 [20] area: 0.0.0.0   + via 10.0.3.3, r1-eth1    N 10.0.3.0/24 [10] area: 0.0.0.0     directly attached to r1-eth1    N 10.0.10.0/24 [20] area: 0.0.0.0     via 10.0.3.1, r1-eth1        ============ OSPF router routing table =============   +R 10.0.255.2 [10] area: 0.0.0.0, ASBR   + via 10.0.3.3, r1-eth1    R 10.0.255.3 [10] area: 0.0.0.0, ASBR     via 10.0.3.1, r1-eth1     assert False
E   AssertionError: OSPF did not converge on r1:
      --- Current output
      +++ Expected output
      @@ -2,12 +2,16 @@
       ============ OSPF network routing table ============
       N 10.0.1.0/24 [10] area: 0.0.0.0
        directly attached to r1-eth0
(14 more lines...)
Collapse Failed test_ospf_topo1_vrf test_ospf_convergence History
TopoTest Tests on Ubuntu 16.04 i386 1 min
AssertionError: OSPF did not converge on r1:   --- Current output   +++ Expected output   @@ -2,12 +2,16 @@    ============ OSPF network routing table ============    N 10.0.1.0/24 [10] area: 0.0.0.0     directly attached to r1-eth0   +N 10.0.2.0/24 [20] area: 0.0.0.0   + via 10.0.3.3, r1-eth1    N 10.0.3.0/24 [10] area: 0.0.0.0     directly attached to r1-eth1    N 10.0.10.0/24 [20] area: 0.0.0.0     via 10.0.3.1, r1-eth1        ============ OSPF router routing table =============   +R 10.0.255.2 [10] area: 0.0.0.0, ASBR   + via 10.0.3.3, r1-eth1    R 10.0.255.3 [10] area: 0.0.0.0, ASBR     via 10.0.3.1, r1-eth1     assert False
E   AssertionError: OSPF did not converge on r1:
      --- Current output
      +++ Expected output
      @@ -2,12 +2,16 @@
       ============ OSPF network routing table ============
       N 10.0.1.0/24 [10] area: 0.0.0.0
        directly attached to r1-eth0
(14 more lines...)
Collapse Failed test_ospf_topo1_vrf test_ospf_kernel_route History
TopoTest Tests on Ubuntu 16.04 i386 1 min
AssertionError: OSPF IPv4 route mismatch in router "r1": --- Current output   +++ Expected output   @@ -1,6 +1,7 @@    VRF r1-cust1:    O   10.0.1.0/24 [110/10] is directly connected, r1-eth0, XX:XX:XX    C>* 10.0.1.0/24 is directly connected, r1-eth0, XX:XX:XX   +O>* 10.0.2.0/24 [110/20] via 10.0.3.3, r1-eth1, XX:XX:XX    O   10.0.3.0/24 [110/10] is directly connected, r1-eth1, XX:XX:XX    C>* 10.0.3.0/24 is directly connected, r1-eth1, XX:XX:XX    O>* 10.0.10.0/24 [110/20] via 10.0.3.1, r1-eth1, XX:XX:XX assert False
E   AssertionError: OSPF IPv4 route mismatch in router "r1": --- Current output
      +++ Expected output
      @@ -1,6 +1,7 @@
       VRF r1-cust1:
       O   10.0.1.0/24 [110/10] is directly connected, r1-eth0, XX:XX:XX
       C>* 10.0.1.0/24 is directly connected, r1-eth0, XX:XX:XX
      +O>* 10.0.2.0/24 [110/20] via 10.0.3.3, r1-eth1, XX:XX:XX
(4 more lines...)