FreeRangeRouting Github Pull Request Testing

Build: #7710 failed Custom build by Github Hook with revision master

Build result summary

Details

Completed
Duration
134 minutes
Flags
Custom revisionCustom build
Labels
version=frr-7_1-dev-1170-g93e793ad5git=https_//github_com/frrouting/frr_gitbuildurl=https_//ci1_netdef_org/browse/frr-frrpullreq-7710branch=master
Revision
cf277e9e7977616272101517633d797c5b100024 cf277e9e7977616272101517633d797c5b100024
Total tests
6016
Fixed in
#7711 (Custom build by Github Hook with revision master)

Tests

Custom variables

Custom revision
cf277e9e7977616272101517633d797c5b100024 cf277e9e7977616272101517633d797c5b100024
Name Value
github_base_sha cf277e9e7977616272101517633d797c5b100024
github_pullreq 4315
github_repo FRRouting/frr
github_merge_sha 93e793ad5c10c7fe7edf3fa63066eb1e5bd2f220
github_branch master

Comments

  1. Github Hook

    GitHub Merge Request 4315
    for GitHub Repo FRRouting/frr, branch master

    Request to merge from lkrishnamoor/frr
    Merge Git Commit ID 93e793ad5c10c7fe7edf3fa63066eb1e5bd2f220 on top of base Git Commit ID cf277e9e7977616272101517633d797c5b100024

Comments on AddressSanitizer Topotest

  1. Anonymous user

    Detected hung build state. Attempting to generate stack trace and terminate spawned sub-processes.

  2. Anonymous user

    Detected hung build state. Attempting to generate stack trace and terminate spawned sub-processes... - HungBuildKiller Plugin

Comments on TopoTest Tests on Ubuntu 16.04 i386

  1. Anonymous user

    Detected hung build state. Attempting to generate stack trace and terminate spawned sub-processes... - HungBuildKiller Plugin

  2. Anonymous user

    Detected hung build state. Attempting to generate stack trace and terminate spawned sub-processes.

Comments on Topology Tests on Ubuntu 18.04 amd64

  1. Anonymous user

    Detected hung build state. Attempting to generate stack trace and terminate spawned sub-processes... - HungBuildKiller Plugin

  2. Anonymous user

    Detected hung build state. Attempting to generate stack trace and terminate spawned sub-processes.

Code commits

Author Commit Message Commit date
Lou Berger Lou Berger cf277e9e7977616272101517633d797c5b100024 cf277e9e7977616272101517633d797c5b100024 Merge pull request #4341 from donaldsharp/bgp_attr_should_actually_compile
bgpd: Fix non-compilation of bgp_attr_extcom_tunnel_type

Tests

New test failures 19
Status Test View job Duration
Collapse Failed test_bfd_topo1 test_bgp_fast_reconvergence History
Topology Tests on Ubuntu 16.04 amd64 3 secs
AssertionError: r4: bgp did not converge assert expected key(s) [u'10.254.254.3/32'] in json["routes"] (have [u'10.254.254.4/32', u'10.254.254.2/32']):   --- Expected value   +++ Current value   @@ -2 +1,0 @@   -    "10.254.254.1/32": null,    @@ -5,0 +5,3 @@   +            "med": 0,    +            "metric": 0,    +            "network": "10.254.254.2/32",    @@ -12,0 +15,3 @@   +            "origin": "IGP",    +            "path": "102",    +            "pathFrom": "external",    @@ -16 +21 @@   -            "valid": true   +            "weight": 0   @@ -19 +24 @@   -    "10.254.254.3/32": [   +    "10.254.254.4/32": [   @@ -21 +26,5 @@   -            "aspath": "102 103",    +            "aspath": "",    +            "bestpath": true,    +            "med": 0,    +            "metric": 0,    +            "network": "10.254.254.4/32",    @@ -25 +34 @@   -                    "ip": "192.168.2.2",    +                    "ip": "0.0.0.0",    @@ -29,2 +38,5 @@   -            "peerId": "192.168.2.2",    -            "prefix": "10.254.254.3",    +            "origin": "IGP",    +            "path": "",    +            "pathFrom": "external",    +            "peerId": "(unspec)",    +            "prefix": "10.254.254.4",    @@ -32 +44,2 @@   -            "valid": true   +            "valid": true,    +            "weight": 32768   json["routes"] value is different (   --- Expected value   +++ Current value   @@ -3,0 +4,3 @@   +        "med": 0,    +        "metric": 0,    +        "network": "10.254.254.2/32",    @@ -10,0 +14,3 @@   +        "origin": "IGP",    +        "path": "102",    +        "pathFrom": "external",    @@ -14 +20 @@   -        "valid": true   +        "weight": 0)
E   AssertionError: r4: bgp did not converge
    assert expected key(s) [u'10.254.254.3/32'] in json["routes"] (have [u'10.254.254.4/32', u'10.254.254.2/32']):
      --- Expected value
      +++ Current value
      @@ -2 +1,0 @@
      -    "10.254.254.1/32": null, 
      @@ -5,0 +5,3 @@
(49 more lines...)
Collapse Failed test_bfd_topo1 test_bgp_fast_convergence History
Topology Tests on Ubuntu 16.04 amd64 25 secs
AssertionError: r4: bgp did not converge assert expected key(s) [u'10.254.254.3/32', u'10.254.254.1/32'] in json["routes"] (have [u'10.254.254.4/32', u'10.254.254.2/32']):   --- Expected value   +++ Current value   @@ -2 +2 @@   -    "10.254.254.1/32": [   +    "10.254.254.2/32": [   @@ -4 +4,4 @@   -            "aspath": "102 101",    +            "aspath": "102",    +            "med": 0,    +            "metric": 0,    +            "network": "10.254.254.2/32",    @@ -11,0 +15,3 @@   +            "origin": "IGP",    +            "path": "102",    +            "pathFrom": "external",    @@ -13 +19 @@   -            "prefix": "10.254.254.1",    +            "prefix": "10.254.254.2",    @@ -15 +21 @@   -            "valid": true   +            "weight": 0   @@ -18 +24 @@   -    "10.254.254.2/32": [   +    "10.254.254.4/32": [   @@ -20 +26,5 @@   -            "aspath": "102",    +            "aspath": "",    +            "bestpath": true,    +            "med": 0,    +            "metric": 0,    +            "network": "10.254.254.4/32",    @@ -24 +34 @@   -                    "ip": "192.168.2.2",    +                    "ip": "0.0.0.0",    @@ -28,2 +38,5 @@   -            "peerId": "192.168.2.2",    -            "prefix": "10.254.254.2",    +            "origin": "IGP",    +            "path": "",    +            "pathFrom": "external",    +            "peerId": "(unspec)",    +            "prefix": "10.254.254.4",    @@ -31,17 +44,2 @@   -            "valid": true   -        }   -    ],    -    "10.254.254.3/32": [   -        {   -            "aspath": "102 103",    -            "nexthops": [   -                {   -                    "afi": "ipv4",    -                    "ip": "192.168.2.2",    -                    "used": true   -                }   -            ],    -            "peerId": "192.168.2.2",    -            "prefix": "10.254.254.3",    -            "prefixLen": 32,    -            "valid": true   +            "valid": true,    +            "weight": 32768   json["routes"] value is different (   --- Expected value   +++ Current value   @@ -3,0 +4,3 @@   +        "med": 0,    +        "metric": 0,    +        "network": "10.254.254.2/32",    @@ -10,0 +14,3 @@   +        "origin": "IGP",    +        "path": "102",    +        "pathFrom": "external",    @@ -14 +20 @@   -        "valid": true   +        "weight": 0)
E   AssertionError: r4: bgp did not converge
    assert expected key(s) [u'10.254.254.3/32', u'10.254.254.1/32'] in json["routes"] (have [u'10.254.254.4/32', u'10.254.254.2/32']):
      --- Expected value
      +++ Current value
      @@ -2 +2 @@
      -    "10.254.254.1/32": [
      +    "10.254.254.2/32": [
(71 more lines...)
Collapse Failed test_bfd_topo2 test_protocols_convergence History
Topology Tests on Ubuntu 16.04 amd64 1 min
AssertionError: "r1" JSON output mismatches assert expected key(s) [u'10.0.3.0/24', u'10.254.254.2/32'] in json (have [u'10.254.254.1/32']):   --- Expected value   +++ Current value   @@ -2,22 +1,0 @@   -    "10.0.3.0/24": [   -        {   -            "distance": 20,    -            "installed": true,    -            "internalFlags": 8,    -            "internalStatus": 34,    -            "metric": 0,    -            "nexthops": [   -                {   -                    "active": true,    -                    "afi": "ipv6",    -                    "fib": true,    -                    "flags": 3,    -                    "interfaceIndex": 2,    -                    "interfaceName": "r1-eth0"   -                }   -            ],    -            "prefix": "10.0.3.0/24",    -            "protocol": "bgp",    -            "selected": true   -        }   -    ],    @@ -25,0 +4 @@   +            "destSelected": true,    @@ -43,23 +22,2 @@   -            "selected": true   -        }   -    ],    -    "10.254.254.2/32": [   -        {   -            "distance": 20,    -            "installed": true,    -            "internalFlags": 8,    -            "internalStatus": 34,    -            "metric": 0,    -            "nexthops": [   -                {   -                    "active": true,    -                    "afi": "ipv6",    -                    "fib": true,    -                    "flags": 3,    -                    "interfaceIndex": 2,    -                    "interfaceName": "r1-eth0"   -                }   -            ],    -            "prefix": "10.254.254.2/32",    -            "protocol": "bgp",    -            "selected": true   +            "selected": true,    +            "uptime": "00:01:45"
E   AssertionError: "r1" JSON output mismatches
    assert expected key(s) [u'10.0.3.0/24', u'10.254.254.2/32'] in json (have [u'10.254.254.1/32']):
      --- Expected value
      +++ Current value
      @@ -2,22 +1,0 @@
      -    "10.0.3.0/24": [
      -        {
(48 more lines...)
Collapse Failed test_bgp_ebgp_requires_policy test_bgp_remove_private_as History
Topology Tests on Ubuntu 16.04 amd64 11 secs
assert False == True   -False   +True
E   assert False == True
      -False
      +True
Collapse Failed test_bgp_l3vpn_to_bgp_direct test_adjacencies History
Topology Tests on Ubuntu 16.04 amd64 1 min
AssertionError: 4 tests failed
E   AssertionError: 4 tests failed
Collapse Failed test_bgp_l3vpn_to_bgp_vrf test_adjacencies History
Topology Tests on Ubuntu 16.04 amd64 5 mins
AssertionError: 7 tests failed
E   AssertionError: 7 tests failed
Collapse Failed test_bgp_multiview_topo1 test_bgp_routingTable History
Topology Tests on Ubuntu 16.04 amd64 < 1 sec
AssertionError: Routing Table verification failed for router r1, view 1: No template matched. template /root/bamboo-agent-home/xml-data/build-dir/FRR-FRRPULLREQ-TOPOU1604/topotests/bgp_multiview_topo1/r1/show_ip_bgp_view_1-post4.1.ref: r1 failed Routing Table Check for view 1: --- actual BGP routing table +++ expected BGP routing table @@ -1,5 +1,4 @@  BGP table version is XXX, local router ID is 172.30.1.1, vrf id - -Default local pref 100, local AS 100  Status codes:  s suppressed, d damped, h history, * valid, > best, = multipath,                 i internal, r RIB-failure, S Stale, R Removed  Nexthop codes: @NNN nexthop's vrf id, < announce-nh-self @@ -39,3 +38,4 @@  *> 10.105.7.0/24    172.16.1.5             100              0 65005 i  *> 10.105.8.0/24    172.16.1.5             100              0 65005 i  *> 10.105.9.0/24    172.16.1.5             100              0 65005 i +*> 172.20.0.0/28    0.0.0.0                  0          32768 i template /root/bamboo-agent-home/xml-data/build-dir/FRR-FRRPULLREQ-TOPOU1604/topotests/bgp_multiview_topo1/r1/show_ip_bgp_view_1-post6.1.ref: r1 failed Routing Table Check for view 1: --- actual BGP routing table +++ expected BGP routing table @@ -39,3 +39,4 @@  *> 10.105.7.0/24    172.16.1.5             100              0 65005 i  *> 10.105.8.0/24    172.16.1.5             100              0 65005 i  *> 10.105.9.0/24    172.16.1.5             100              0 65005 i +*> 172.20.0.0/28    0.0.0.0                  0          32768 i template /root/bamboo-agent-home/xml-data/build-dir/FRR-FRRPULLREQ-TOPOU1604/topotests/bgp_multiview_topo1/r1/show_ip_bgp_view_1.ref: r1 failed Routing Table Check for view 1: --- actual BGP routing table +++ expected BGP routing table @@ -1,9 +1,7 @@ -BGP table version is XXX, local router ID is 172.30.1.1, vrf id - -Default local pref 100, local AS 100 -Status codes:  s suppressed, d damped, h history, * valid, > best, = multipath, -               i internal, r RIB-failure, S Stale, R Removed -Nexthop codes: @NNN nexthop's vrf id, < announce-nh-self -Origin codes:  i - IGP, e - EGP, ? - incomplete +BGP table version is XXX, local router ID is 172.30.1.1 +Status codes: s suppressed, d damped, h history, * valid, > best, = multipath, +              i internal, r RIB-failure, S Stale, R Removed +Origin codes: i - IGP, e - EGP, ? - incomplete       Network          Next Hop            Metric LocPrf Weight Path  *  10.0.1.0/24      172.16.1.5                             0 65005 i @@ -39,3 +37,4 @@  *> 10.105.7.0/24    172.16.1.5             100              0 65005 i  *> 10.105.8.0/24    172.16.1.5             100              0 65005 i  *> 10.105.9.0/24    172.16.1.5             100              0 65005 i +*> 172.20.0.0/28    0.0.0.0                  0          32768 i
E   AssertionError: Routing Table verification failed for router r1, view 1:
    No template matched.
    template /root/bamboo-agent-home/xml-data/build-dir/FRR-FRRPULLREQ-TOPOU1604/topotests/bgp_multiview_topo1/r1/show_ip_bgp_view_1-post4.1.ref: r1 failed Routing Table Check for view 1:
    --- actual BGP routing table
    +++ expected BGP routing table
    @@ -1,5 +1,4 @@
     BGP table version is XXX, local router ID is 172.30.1.1, vrf id -
(39 more lines...)
Collapse Failed test_bgp_rfapi_basic_sanity_config2 test_adjacencies History
Topology Tests on Ubuntu 16.04 amd64 1 min
AssertionError: 4 tests failed
E   AssertionError: 4 tests failed
Collapse Failed test_bgp_rfapi_basic_sanity test_adjacencies History
Topology Tests on Ubuntu 16.04 amd64 1 min
AssertionError: 4 tests failed
E   AssertionError: 4 tests failed
Collapse Failed test_bgp_vrf_netns_topo test_bgp_vrf_netns History
Topology Tests on Ubuntu 16.04 amd64 8 secs
AssertionError: expected routes in "show ip bgp vrf r1-cust1 ipv4" output assert json["routes"] value is different (   --- Expected value   +++ Current value   @@ -3 +3,18 @@   -        "valid": true   +        "aspath": "99",    +        "med": 100,    +        "metric": 100,    +        "network": "10.201.3.0/24",    +        "nexthops": [   +            {   +                "afi": "ipv4",    +                "ip": "10.0.1.101",    +                "used": true   +            }   +        ],    +        "origin": "IGP",    +        "path": "99",    +        "pathFrom": "external",    +        "peerId": "10.0.1.101",    +        "prefix": "10.201.3.0",    +        "prefixLen": 24,    +        "weight": 0)   json["routes"] value is different (   --- Expected value   +++ Current value   @@ -3 +3,18 @@   -        "valid": true   +        "aspath": "99",    +        "med": 100,    +        "metric": 100,    +        "network": "10.201.6.0/24",    +        "nexthops": [   +            {   +                "afi": "ipv4",    +                "ip": "10.0.1.101",    +                "used": true   +            }   +        ],    +        "origin": "IGP",    +        "path": "99",    +        "pathFrom": "external",    +        "peerId": "10.0.1.101",    +        "prefix": "10.201.6.0",    +        "prefixLen": 24,    +        "weight": 0)   json["routes"] value is different (   --- Expected value   +++ Current value   @@ -3 +3,18 @@   -        "valid": true   +        "aspath": "99",    +        "med": 100,    +        "metric": 100,    +        "network": "10.201.5.0/24",    +        "nexthops": [   +            {   +                "afi": "ipv4",    +                "ip": "10.0.1.101",    +                "used": true   +            }   +        ],    +        "origin": "IGP",    +        "path": "99",    +        "pathFrom": "external",    +        "peerId": "10.0.1.101",    +        "prefix": "10.201.5.0",    +        "prefixLen": 24,    +        "weight": 0)   json["routes"] value is different (   --- Expected value   +++ Current value   @@ -3 +3,18 @@   -        "valid": true   +        "aspath": "99",    +        "med": 100,    +        "metric": 100,    +        "network": "10.201.8.0/24",    +        "nexthops": [   +            {   +                "afi": "ipv4",    +                "ip": "10.0.1.101",    +                "used": true   +            }   +        ],    +        "origin": "IGP",    +        "path": "99",    +        "pathFrom": "external",    +        "peerId": "10.0.1.101",    +        "prefix": "10.201.8.0",    +        "prefixLen": 24,    +        "weight": 0)   json["routes"] value is different (   --- Expected value   +++ Current value   @@ -3 +3,18 @@   -        "valid": true   +        "aspath": "99",    +        "med": 100,    +        "metric": 100,    +        "network": "10.201.9.0/24",    +        "nexthops": [   +            {   +                "afi": "ipv4",    +                "ip": "10.0.1.101",    +                "used": true   +            }   +        ],    +        "origin": "IGP",    +        "path": "99",    +        "pathFrom": "external",    +        "peerId": "10.0.1.101",    +        "prefix": "10.201.9.0",    +        "prefixLen": 24,    +        "weight": 0)   json["routes"] value is different (   --- Expected value   +++ Current value   @@ -3 +3,18 @@   -        "valid": true   +        "aspath": "99",    +        "med": 100,    +        "metric": 100,    +        "network": "10.201.0.0/24",    +        "nexthops": [   +            {   +                "afi": "ipv4",    +                "ip": "10.0.1.101",    +                "used": true   +            }   +        ],    +        "origin": "IGP",    +        "path": "99",    +        "pathFrom": "external",    +        "peerId": "10.0.1.101",    +        "prefix": "10.201.0.0",    +        "prefixLen": 24,    +        "weight": 0)   json["routes"] value is different (   --- Expected value   +++ Current value   @@ -3 +3,18 @@   -        "valid": true   +        "aspath": "99",    +        "med": 100,    +        "metric": 100,    +        "network": "10.201.2.0/24",    +        "nexthops": [   +            {   +                "afi": "ipv4",    +                "ip": "10.0.1.101",    +                "used": true   +            }   +        ],    +        "origin": "IGP",    +        "path": "99",    +        "pathFrom": "external",    +        "peerId": "10.0.1.101",    +        "prefix": "10.201.2.0",    +        "prefixLen": 24,    +        "weight": 0)   json["routes"] value is different (   --- Expected value   +++ Current value   @@ -3 +3,18 @@   -        "valid": true   +        "aspath": "99",    +        "med": 100,    +        "metric": 100,    +        "network": "10.201.1.0/24",    +        "nexthops": [   +            {   +                "afi": "ipv4",    +                "ip": "10.0.1.101",    +                "used": true   +            }   +        ],    +        "origin": "IGP",    +        "path": "99",    +        "pathFrom": "external",    +        "peerId": "10.0.1.101",    +        "prefix": "10.201.1.0",    +        "prefixLen": 24,    +        "weight": 0)   json["routes"] value is different (   --- Expected value   +++ Current value   @@ -3 +3,18 @@   -        "valid": true   +        "aspath": "99",    +        "med": 100,    +        "metric": 100,    +        "network": "10.201.4.0/24",    +        "nexthops": [   +            {   +                "afi": "ipv4",    +                "ip": "10.0.1.101",    +                "used": true   +            }   +        ],    +        "origin": "IGP",    +        "path": "99",    +        "pathFrom": "external",    +        "peerId": "10.0.1.101",    +        "prefix": "10.201.4.0",    +        "prefixLen": 24,    +        "weight": 0)   json["routes"] value is different (   --- Expected value   +++ Current value   @@ -3 +3,18 @@   -        "valid": true   +        "aspath": "99",    +        "med": 100,    +        "metric": 100,    +        "network": "10.201.7.0/24",    +        "nexthops": [   +            {   +                "afi": "ipv4",    +                "ip": "10.0.1.101",    +                "used": true   +            }   +        ],    +        "origin": "IGP",    +        "path": "99",    +        "pathFrom": "external",    +        "peerId": "10.0.1.101",    +        "prefix": "10.201.7.0",    +        "prefixLen": 24,    +        "weight": 0)
E   AssertionError: expected routes in "show ip bgp vrf r1-cust1 ipv4" output
    assert json["routes"] value is different (
      --- Expected value
      +++ Current value
      @@ -3 +3,18 @@
      -        "valid": true
      +        "aspath": "99", 
(224 more lines...)
Collapse Failed test_eigrp_topo1 test_zebra_ipv4_routingTable History
Topology Tests on Ubuntu 16.04 amd64 < 1 sec
AssertionError: Zebra IPv4 Routing Table verification failed for router r3 assert expected key(s) [u'192.168.2.0/24'] in json (have [u'192.168.1.0/24', u'192.168.3.0/24', u'193.1.1.0/26', u'193.1.2.0/24']):   --- Expected value   +++ Current value   @@ -3,0 +4,5 @@   +            "destSelected": true,    +            "distance": 90,    +            "installed": true,    +            "internalFlags": 8,    +            "internalStatus": 34,    @@ -9,0 +15,2 @@   +                    "flags": 3,    +                    "interfaceIndex": 2,    @@ -16,19 +23,2 @@   -            "selected": true   -        }   -    ],    -    "192.168.2.0/24": [   -        {   -            "distance": 1,    -            "metric": 0,    -            "nexthops": [   -                {   -                    "active": true,    -                    "afi": "ipv4",    -                    "fib": true,    -                    "interfaceName": "r3-eth0",    -                    "ip": "192.168.3.10"   -                }   -            ],    -            "prefix": "192.168.2.0/24",    -            "protocol": "static",    -            "selected": true   +            "selected": true,    +            "uptime": "00:00:06"   @@ -38,0 +29,3 @@   +            "distance": 90,    +            "internalFlags": 0,    +            "internalStatus": 0,    @@ -43,0 +37,2 @@   +                    "flags": 1,    +                    "interfaceIndex": 3,    @@ -48 +43,2 @@   -            "protocol": "eigrp"   +            "protocol": "eigrp",    +            "uptime": "00:00:08"   @@ -50,0 +47,6 @@   +            "destSelected": true,    +            "distance": 0,    +            "installed": true,    +            "internalFlags": 8,    +            "internalStatus": 32,    +            "metric": 0,    @@ -55,0 +58,2 @@   +                    "flags": 3,    +                    "interfaceIndex": 3,    @@ -61 +65,2 @@   -            "selected": true   +            "selected": true,    +            "uptime": "00:00:09"   @@ -65,0 +71,5 @@   +            "destSelected": true,    +            "distance": 90,    +            "installed": true,    +            "internalFlags": 8,    +            "internalStatus": 34,    @@ -71,0 +82,2 @@   +                    "flags": 3,    +                    "interfaceIndex": 2,    @@ -78 +90,2 @@   -            "selected": true   +            "selected": true,    +            "uptime": "00:00:06"   @@ -82,0 +96,3 @@   +            "distance": 90,    +            "internalFlags": 0,    +            "internalStatus": 0,    @@ -87,0 +104,2 @@   +                    "flags": 1,    +                    "interfaceIndex": 2,    @@ -92 +110,2 @@   -            "protocol": "eigrp"   +            "protocol": "eigrp",    +            "uptime": "00:00:08"   @@ -94,0 +114,6 @@   +            "destSelected": true,    +            "distance": 0,    +            "installed": true,    +            "internalFlags": 8,    +            "internalStatus": 32,    +            "metric": 0,    @@ -99,0 +125,2 @@   +                    "flags": 3,    +                    "interfaceIndex": 2,    @@ -105 +132,2 @@   -            "selected": true   +            "selected": true,    +            "uptime": "00:00:09"
E   AssertionError: Zebra IPv4 Routing Table verification failed for router r3
    assert expected key(s) [u'192.168.2.0/24'] in json (have [u'192.168.1.0/24', u'192.168.3.0/24', u'193.1.1.0/26', u'193.1.2.0/24']):
      --- Expected value
      +++ Current value
      @@ -3,0 +4,5 @@
      +            "destSelected": true, 
      +            "distance": 90, 
(91 more lines...)
Collapse Failed test_ospf6_topo1 test_linux_ipv6_kernel_routingTable History
Topology Tests on Ubuntu 16.04 amd64 < 1 sec
AssertionError: Linux Kernel IPv6 Routing Table verification failed for router r1:   --- actual OSPFv3 IPv6 routing table   +++ expected OSPFv3 IPv6 routing table   @@ -1,6 +1,10 @@   +fc00:1111:1111:1111::/64 via fc00:1:1:1::1234 dev r1-stubnet proto XXXX metric 20 pref medium    fc00:1:1:1::/64 dev r1-stubnet proto XXXX metric 256 pref medium   +fc00:2222:2222:2222::/64 via fe80::__(r2-sw5)__ dev r1-sw5 proto XXXX metric 20 pref medium    fc00:2:2:2::/64 via fe80::__(r2-sw5)__ dev r1-sw5 proto XXXX metric 20 pref medium   +fc00:3333:3333:3333::/64 via fe80::__(r3-sw5)__ dev r1-sw5 proto XXXX metric 20 pref medium    fc00:3:3:3::/64 via fe80::__(r3-sw5)__ dev r1-sw5 proto XXXX metric 20 pref medium   +fc00:4444:4444:4444::/64 via fe80::__(r3-sw5)__ dev r1-sw5 proto XXXX metric 20 pref medium    fc00:4:4:4::/64 via fe80::__(r3-sw5)__ dev r1-sw5 proto XXXX metric 20 pref medium    fc00:a:a:a::/64 dev r1-sw5 proto XXXX metric 256 pref medium    fc00:b:b:b::/64 via fe80::__(r3-sw5)__ dev r1-sw5 proto XXXX metric 20 pref medium assert 1 == 0   -1   +0
E   AssertionError: Linux Kernel IPv6 Routing Table verification failed for router r1:
      --- actual OSPFv3 IPv6 routing table
      +++ expected OSPFv3 IPv6 routing table
      @@ -1,6 +1,10 @@
      +fc00:1111:1111:1111::/64 via fc00:1:1:1::1234 dev r1-stubnet proto XXXX metric 20 pref medium
       fc00:1:1:1::/64 dev r1-stubnet proto XXXX metric 256 pref medium
      +fc00:2222:2222:2222::/64 via fe80::__(r2-sw5)__ dev r1-sw5 proto XXXX metric 20 pref medium
(10 more lines...)
Collapse Failed test_ospf6_topo1 test_ospfv3_routingTable History
Topology Tests on Ubuntu 16.04 amd64 < 1 sec
AssertionError: OSPFv3 (IPv6) Routing Table verification failed for router r1:   --- actual OSPFv3 IPv6 routing table   +++ expected OSPFv3 IPv6 routing table   @@ -4,3 +4,6 @@    O>* fc00:4:4:4::/64 [110/30] via fe80::XXXX:XXXX:XXXX:XXXX, r1-sw5    O   fc00:a:a:a::/64 [110/10] is directly connected, r1-sw5    O>* fc00:b:b:b::/64 [110/20] via fe80::XXXX:XXXX:XXXX:XXXX, r1-sw5   +O>* fc00:2222:2222:2222::/64 [110/10] via fe80::XXXX:XXXX:XXXX:XXXX, r1-sw5   +O>* fc00:3333:3333:3333::/64 [110/10] via fe80::XXXX:XXXX:XXXX:XXXX, r1-sw5   +O>* fc00:4444:4444:4444::/64 [110/20] via fe80::XXXX:XXXX:XXXX:XXXX, r1-sw5 assert 1 == 0   -1   +0
E   AssertionError: OSPFv3 (IPv6) Routing Table verification failed for router r1:
      --- actual OSPFv3 IPv6 routing table
      +++ expected OSPFv3 IPv6 routing table
      @@ -4,3 +4,6 @@
       O>* fc00:4:4:4::/64 [110/30] via fe80::XXXX:XXXX:XXXX:XXXX, r1-sw5
       O   fc00:a:a:a::/64 [110/10] is directly connected, r1-sw5
       O>* fc00:b:b:b::/64 [110/20] via fe80::XXXX:XXXX:XXXX:XXXX, r1-sw5
(6 more lines...)
Collapse Failed test_pim test_pim_igmp_report History
Topology Tests on Ubuntu 16.04 amd64 < 1 sec
AssertionError: failed to converge pim assert json["229.1.1.2"]["*"]["joinState"] value is different (   --- Expected value   +++ Current value   @@ -1 +1 @@   -"Joined"   +"NotJoined")
E   AssertionError: failed to converge pim
    assert json["229.1.1.2"]["*"]["joinState"] value is different (
      --- Expected value
      +++ Current value
      @@ -1 +1 @@
      -"Joined"
      +"NotJoined")
Collapse Failed test_pim test_pim_send_mcast_stream History
Topology Tests on Ubuntu 16.04 amd64 5 secs
AssertionError: failed to converge pim assert json["229.1.1.1"]["10.0.20.2"]["regState"] value is different (   --- Expected value   +++ Current value   @@ -1 +1 @@   -"RegPrune"   +"RegJoined")
E   AssertionError: failed to converge pim
    assert json["229.1.1.1"]["10.0.20.2"]["regState"] value is different (
      --- Expected value
      +++ Current value
      @@ -1 +1 @@
      -"RegPrune"
      +"RegJoined")
Collapse Failed test_ripng_topo1 test_zebra_ipv6_routingTable History
Topology Tests on Ubuntu 16.04 amd64 < 1 sec
AssertionError: Zebra IPv6 Routing Table verification failed for router r1:   --- actual Zebra IPv6 routing table   +++ expected Zebra IPv6 routing table   @@ -1,2 +1,3 @@    R>* fc00:6::/62 [120/2] via fe80::XXXX:XXXX:XXXX:XXXX, r1-eth1    R>* fc00:7::/64 [120/3] via fe80::XXXX:XXXX:XXXX:XXXX, r1-eth1   +R>* fc00:7:1111::/64 [120/3] via fe80::XXXX:XXXX:XXXX:XXXX, r1-eth1 assert 1 == 0   -1   +0
E   AssertionError: Zebra IPv6 Routing Table verification failed for router r1:
      --- actual Zebra IPv6 routing table
      +++ expected Zebra IPv6 routing table
      @@ -1,2 +1,3 @@
       R>* fc00:6::/62 [120/2] via fe80::XXXX:XXXX:XXXX:XXXX, r1-eth1
       R>* fc00:7::/64 [120/3] via fe80::XXXX:XXXX:XXXX:XXXX, r1-eth1
      +R>* fc00:7:1111::/64 [120/3] via fe80::XXXX:XXXX:XXXX:XXXX, r1-eth1
(3 more lines...)
Collapse Failed test_ripng_topo1 test_ripng_routes History
Topology Tests on Ubuntu 16.04 amd64 < 1 sec
AssertionError: SHOW IPv6 RIPng failed for router r1:   --- actual SHOW IPv6 RIPng   +++ expected SHOW IPv6 RIPng   @@ -10,3 +10,5 @@                      fe80::XXXX:XXXX:XXXX:XXXX   r1-eth1    2    0  XX:XX    R(n) fc00:7::/64                      fe80::XXXX:XXXX:XXXX:XXXX   r1-eth1    3    0  XX:XX   +R(n) fc00:7:1111::/64   +                  fe80::XXXX:XXXX:XXXX:XXXX   r1-eth1    3    0  XX:XX assert 1 == 0   -1   +0
E   AssertionError: SHOW IPv6 RIPng failed for router r1:
      --- actual SHOW IPv6 RIPng
      +++ expected SHOW IPv6 RIPng
      @@ -10,3 +10,5 @@
                         fe80::XXXX:XXXX:XXXX:XXXX   r1-eth1    2    0  XX:XX
       R(n) fc00:7::/64
                         fe80::XXXX:XXXX:XXXX:XXXX   r1-eth1    3    0  XX:XX
(5 more lines...)
Collapse Failed test_rip_topo1 test_rip_routes History
Topology Tests on Ubuntu 16.04 amd64 < 1 sec
AssertionError: SHOW IP RIP failed for router r1:   --- actual SHOW IP RIP   +++ expected SHOW IP RIP   @@ -4,6 +4,7 @@          (i) - interface             Network            Next Hop         Metric From            Tag Time   +R(n) 192.168.2.0/24     193.1.1.2             3 193.1.1.2         0 XX:XX    R(n) 192.168.3.0/24     193.1.1.2             3 193.1.1.2         0 XX:XX    C(i) 193.1.1.0/26       0.0.0.0               1 self              0    R(n) 193.1.2.0/24       193.1.1.2             2 193.1.1.2         0 XX:XX assert 1 == 0   -1   +0
E   AssertionError: SHOW IP RIP failed for router r1:
      --- actual SHOW IP RIP
      +++ expected SHOW IP RIP
      @@ -4,6 +4,7 @@
             (i) - interface
       
            Network            Next Hop         Metric From            Tag Time
(7 more lines...)
Collapse Failed test_rip_topo1 test_zebra_ipv4_routingTable History
Topology Tests on Ubuntu 16.04 amd64 < 1 sec
AssertionError: Zebra IPv4 Routing Table verification failed for router r1:   --- actual Zebra IPv4 routing table   +++ expected Zebra IPv4 routing table   @@ -1,2 +1,3 @@   +R>* 192.168.2.0/24 [120/3] via 193.1.1.2, r1-eth1    R>* 192.168.3.0/24 [120/3] via 193.1.1.2, r1-eth1    R>* 193.1.2.0/24 [120/2] via 193.1.1.2, r1-eth1 assert 1 == 0   -1   +0
E   AssertionError: Zebra IPv4 Routing Table verification failed for router r1:
      --- actual Zebra IPv4 routing table
      +++ expected Zebra IPv4 routing table
      @@ -1,2 +1,3 @@
      +R>* 192.168.2.0/24 [120/3] via 193.1.1.2, r1-eth1
       R>* 192.168.3.0/24 [120/3] via 193.1.1.2, r1-eth1
       R>* 193.1.2.0/24 [120/2] via 193.1.1.2, r1-eth1
(3 more lines...)