FreeRangeRouting Github Pull Request Testing

Build: #8350 failed Custom build by Github Hook with revision master

Build result summary

Details

Completed
Duration
102 minutes
Flags
Custom revisionCustom build
Labels
version=frr-7_1-dev-2054-g822c9af23git=https_//github_com/frrouting/frr_gitbuildurl=https_//ci1_netdef_org/browse/frr-frrpullreq-8350branch=master
Revision
84f4f72638d7f82fbbcb65599d8a27e7ef88bc8c 84f4f72638d7f82fbbcb65599d8a27e7ef88bc8c
Total tests
6944
Fixed in
#8353 (Custom build by Github Hook with revision stable/6.0)

Tests

Custom variables

Custom revision
84f4f72638d7f82fbbcb65599d8a27e7ef88bc8c 84f4f72638d7f82fbbcb65599d8a27e7ef88bc8c
Name Value
github_base_sha f85d5e3d972dc507cfd277a62c938d967cb28974
github_pullreq 4664
github_repo FRRouting/frr
github_merge_sha 822c9af2302e4e53708a169513ddfc6de755c69e
github_branch master

Comments

  1. Github Hook

    GitHub Merge Request 4664
    for GitHub Repo FRRouting/frr, branch master

    Request to merge from sworleys/frr
    Merge Git Commit ID 822c9af2302e4e53708a169513ddfc6de755c69e on top of base Git Commit ID f85d5e3d972dc507cfd277a62c938d967cb28974

Code commits

Author Commit Message Commit date
Sri Mohana Singamsetty <srimohans@gmail.com> Sri Mohana Singamsetty <srimohans@gmail.com> 84f4f72638d7f82fbbcb65599d8a27e7ef88bc8c 84f4f72638d7f82fbbcb65599d8a27e7ef88bc8c Merge pull request #4670 from chiragshah6/evpn_dev1
bgpd: fix show bgp l2vpn evpn route json

Tests

New test failures 2
Status Test View job Duration
Collapse Failed test_bgp_basic_functionality test_static_routes History
Topology Tests on Ubuntu 18.04 amd64 5 secs
AssertionError: Testcase test_static_routes :Failed     Error: No bgp route found in rib of router r3.. assert 'No bgp route found in rib of router r3..' is True
E   AssertionError: Testcase test_static_routes :Failed 
       Error: No bgp route found in rib of router r3..
    assert 'No bgp route found in rib of router r3..' is True
Collapse Failed test_prefix_lists test_modify_prefix_lists_out_permit_to_deny History
Topology Tests on Ubuntu 18.04 amd64 6 secs
AssertionError: Testcase test_modify_prefix_lists_out_permit_to_deny : Failed     Error: No bgp route found in rib of router r4.. assert 'No bgp route found in rib of router r4..' is True
E   AssertionError: Testcase test_modify_prefix_lists_out_permit_to_deny : Failed 
       Error: No bgp route found in rib of router r4..
    assert 'No bgp route found in rib of router r4..' is True