FreeRangeRouting Github Pull Request Testing

Build: #8380 failed Custom build by Github Hook with revision stable/6.0

Build result summary

Details

Completed
Duration
90 minutes
Flags
Custom revisionCustom build
Labels
version=frr-6_0_3-30-gfc945c008git=https_//github_com/frrouting/frr_gitbuildurl=https_//ci1_netdef_org/browse/frr-frrpullreq-8380branch=stable/6_0
Revision
5aeb05c112453c30529aa424740746f327038464 5aeb05c112453c30529aa424740746f327038464
Total tests
6474
Fixed in
#8381 (Custom build by Github Hook with revision master)

Tests

Custom variables

Custom revision
5aeb05c112453c30529aa424740746f327038464 5aeb05c112453c30529aa424740746f327038464
Name Value
github_base_sha 5aeb05c112453c30529aa424740746f327038464
github_pullreq 4702
github_repo FRRouting/frr
github_merge_sha fc945c008adbf059d266731d65aae097c0e6a965
github_branch stable/6.0

Comments

  1. Github Hook

    GitHub Merge Request 4702
    for GitHub Repo FRRouting/frr, branch stable/6.0

    Request to merge from FRRouting/frr
    Merge Git Commit ID fc945c008adbf059d266731d65aae097c0e6a965 on top of base Git Commit ID 5aeb05c112453c30529aa424740746f327038464

Code commits

Author Commit Message Commit date
Renato Westphal Renato Westphal 5aeb05c112453c30529aa424740746f327038464 5aeb05c112453c30529aa424740746f327038464 Merge pull request #4667 from ton31337/fix/show_delete_suboption_for_set_comm-list_6.0
bgpd: [6.0] Show `delete` sub-option for `set [l]comm-list <list> delete`

Tests

New test failures 2
Status Test View job Duration
Collapse Failed test_ldp_vpls_topo1 test_ldp_bindings History
Topology Tests on Ubuntu 16.04 amd64 2 mins
AssertionError: "r1" JSON output mismatches the expected result assert json value is different (   --- Expected value   +++ Current value   @@ -21 +21 @@   -        "localLabel": "17",    +        "localLabel": "18",    @@ -29 +29 @@   -        "localLabel": "17",    +        "localLabel": "18",    @@ -37 +37 @@   -        "localLabel": "18",    +        "localLabel": "17",    @@ -45 +45 @@   -        "localLabel": "18",    +        "localLabel": "17", )
E   AssertionError: "r1" JSON output mismatches the expected result
    assert json value is different (
      --- Expected value
      +++ Current value
      @@ -21 +21 @@
      -        "localLabel": "17", 
      +        "localLabel": "18", 
(9 more lines...)
Collapse Failed test_ldp_vpls_topo1 test_ldp_bindings History
TopoTest Tests on Ubuntu 16.04 i386 2 mins
AssertionError: "r1" JSON output mismatches the expected result assert json value is different (   --- Expected value   +++ Current value   @@ -8 +8 @@   -        "remoteLabel": "17"   +        "remoteLabel": "18"   @@ -16 +16 @@   -        "remoteLabel": "16"   +        "remoteLabel": "17"   @@ -32 +32 @@   -        "remoteLabel": "17"   +        "remoteLabel": "16"   @@ -40 +40 @@   -        "remoteLabel": "18"   +        "remoteLabel": "17")
E   AssertionError: "r1" JSON output mismatches the expected result
    assert json value is different (
      --- Expected value
      +++ Current value
      @@ -8 +8 @@
      -        "remoteLabel": "17"
      +        "remoteLabel": "18"
(9 more lines...)