FreeRangeRouting Github Pull Request Testing

Build: #8596 failed Custom build by Github Hook with revision master

Build result summary

Details

Completed
Duration
106 minutes
Flags
Custom revisionCustom build
Labels
version=frr-7_1-dev-2305-g524946e93git=https_//github_com/frrouting/frr_gitbuildurl=https_//ci1_netdef_org/browse/frr-frrpullreq-8596branch=master
Revision
bb5fd82d90329bc0ae515d28fd55ebf048044295 bb5fd82d90329bc0ae515d28fd55ebf048044295
Total tests
6936
Fixed in
#8597 (Custom build by Github Hook with revision master)

Tests

Custom variables

Custom revision
bb5fd82d90329bc0ae515d28fd55ebf048044295 bb5fd82d90329bc0ae515d28fd55ebf048044295
Name Value
github_base_sha bb5fd82d90329bc0ae515d28fd55ebf048044295
github_pullreq 4810
github_repo FRRouting/frr
github_merge_sha 524946e932e1a5e70e4bfcf4e36fa536c8cf44af
github_branch master

Comments

  1. Github Hook

    GitHub Merge Request 4810
    for GitHub Repo FRRouting/frr, branch master

    Request to merge from qlyoung/frr
    Merge Git Commit ID 524946e932e1a5e70e4bfcf4e36fa536c8cf44af on top of base Git Commit ID bb5fd82d90329bc0ae515d28fd55ebf048044295

Code commits

Author Commit Message Commit date
David Lamparter David Lamparter bb5fd82d90329bc0ae515d28fd55ebf048044295 bb5fd82d90329bc0ae515d28fd55ebf048044295 Merge pull request #4677 from mruprich/master
ospfd,ripd: Enabling openssl library for md5 authentication in RIP and OSPF

Tests

New test failures 80
Status Test View job Duration
Collapse Failed test_all_protocol_startup test_shutdown_check_stderr History
Topology Tests on Ubuntu 16.04 amd64 3 secs
AssertionError:  r1: bgpd crashed. Core file found - Backtrace follows: [New LWP 28372] [New LWP 28382] [Thread debugging using libthread_db enabled] Using host libthread_db library "/lib/x86_64-linux-gnu/libthread_db.so.1". Core was generated by `/usr/lib/frr/bgpd'. Program terminated with signal SIGABRT, Aborted. #0  0x00007f73d5345428 in __GI_raise (sig=sig@entry=6) at ../sysdeps/unix/sysv/linux/raise.c:54 [Current thread is 1 (Thread 0x7f73d6388880 (LWP 28372))] #0  0x00007f73d5345428 in __GI_raise (sig=sig@entry=6) at ../sysdeps/unix/sysv/linux/raise.c:54 #1  0x00007f73d534702a in __GI_abort () at abort.c:89 #2  0x00007f73d607c250 in ?? () from /usr/lib/x86_64-linux-gnu/frr/libfrr.so.0 #3  <signal handler called> #4  __lll_lock_wait () at ../sysdeps/unix/sysv/linux/x86_64/lowlevellock.S:135 #5  0x00007f73d56e3dbd in __GI___pthread_mutex_lock (mutex=0x7f73d62ea300) at ../nptl/pthread_mutex_lock.c:80 #6  0x00007f73d604ecec in frr_pthread_destroy () from /usr/lib/x86_64-linux-gnu/frr/libfrr.so.0 #7  0x00007f73d605ae0a in list_delete_all_node () from /usr/lib/x86_64-linux-gnu/frr/libfrr.so.0 #8  0x00007f73d605ae79 in list_delete () from /usr/lib/x86_64-linux-gnu/frr/libfrr.so.0 #9  0x00007f73d604ee1c in frr_pthread_finish () from /usr/lib/x86_64-linux-gnu/frr/libfrr.so.0 #10 0x00007f73d605a6d2 in frr_fini () from /usr/lib/x86_64-linux-gnu/frr/libfrr.so.0 #11 0x00005616e97c7d53 in sigint () #12 0x00007f73d607c2f3 in quagga_sigevent_process () from /usr/lib/x86_64-linux-gnu/frr/libfrr.so.0 #13 0x00007f73d6089655 in thread_fetch () from /usr/lib/x86_64-linux-gnu/frr/libfrr.so.0 #14 0x00007f73d605a413 in frr_run () from /usr/lib/x86_64-linux-gnu/frr/libfrr.so.0 #15 0x00005616e97c59e1 in main ()
E   AssertionError: 
    r1: bgpd crashed. Core file found - Backtrace follows:
    [New LWP 28372]
    [New LWP 28382]
    [Thread debugging using libthread_db enabled]
    Using host libthread_db library "/lib/x86_64-linux-gnu/libthread_db.so.1".
    Core was generated by `/usr/lib/frr/bgpd'.
(19 more lines...)
Collapse Failed test_all_protocol_startup test_shutdown_check_stderr History
Topology Tests on Ubuntu 18.04 amd64 3 secs
AssertionError:  r1: bgpd crashed. Core file found - Backtrace follows: [New LWP 6256] [New LWP 6266] [Thread debugging using libthread_db enabled] Using host libthread_db library "/lib/x86_64-linux-gnu/libthread_db.so.1". Core was generated by `/usr/lib/frr/bgpd'. Program terminated with signal SIGABRT, Aborted. #0  __GI_raise (sig=sig@entry=6) at ../sysdeps/unix/sysv/linux/raise.c:51 [Current thread is 1 (Thread 0x7fe2f510c7c0 (LWP 6256))] #0  __GI_raise (sig=sig@entry=6) at ../sysdeps/unix/sysv/linux/raise.c:51 #1  0x00007fe2f3f90801 in __GI_abort () at abort.c:79 #2  0x00007fe2f4d7a7bf in ?? () from /usr/lib/x86_64-linux-gnu/frr/libfrr.so.0 #3  <signal handler called> #4  __lll_lock_wait () at ../sysdeps/unix/sysv/linux/x86_64/lowlevellock.S:135 #5  0x00007fe2f434b023 in __GI___pthread_mutex_lock (mutex=0x7fe2f4fe8300) at ../nptl/pthread_mutex_lock.c:78 #6  0x00007fe2f4d4d1dc in frr_pthread_destroy () from /usr/lib/x86_64-linux-gnu/frr/libfrr.so.0 #7  0x00007fe2f4d5940b in list_delete_all_node () from /usr/lib/x86_64-linux-gnu/frr/libfrr.so.0 #8  0x00007fe2f4d59479 in list_delete () from /usr/lib/x86_64-linux-gnu/frr/libfrr.so.0 #9  0x00007fe2f4d4d30c in frr_pthread_finish () from /usr/lib/x86_64-linux-gnu/frr/libfrr.so.0 #10 0x00007fe2f4d58cc2 in frr_fini () from /usr/lib/x86_64-linux-gnu/frr/libfrr.so.0 #11 0x0000564adf8cbcc9 in sigint () #12 0x00007fe2f4d7a853 in quagga_sigevent_process () from /usr/lib/x86_64-linux-gnu/frr/libfrr.so.0 #13 0x00007fe2f4d8787d in thread_fetch () from /usr/lib/x86_64-linux-gnu/frr/libfrr.so.0 #14 0x00007fe2f4d589f3 in frr_run () from /usr/lib/x86_64-linux-gnu/frr/libfrr.so.0 #15 0x0000564adf8c9961 in main ()
E   AssertionError: 
    r1: bgpd crashed. Core file found - Backtrace follows:
    [New LWP 6256]
    [New LWP 6266]
    [Thread debugging using libthread_db enabled]
    Using host libthread_db library "/lib/x86_64-linux-gnu/libthread_db.so.1".
    Core was generated by `/usr/lib/frr/bgpd'.
(19 more lines...)
Collapse Failed test_all_protocol_startup test_shutdown_check_stderr History
TopoTest Tests on Ubuntu 16.04 i386 3 secs
AssertionError:  r1: bgpd crashed. Core file found - Backtrace follows: [New LWP 6980] [New LWP 6990] [Thread debugging using libthread_db enabled] Using host libthread_db library "/lib/i386-linux-gnu/libthread_db.so.1". Core was generated by `/usr/lib/frr/bgpd'. Program terminated with signal SIGABRT, Aborted. #0  0xb7f11d05 in ?? () [Current thread is 1 (Thread 0xb78637c0 (LWP 6980))] #0  0xb7f11d05 in ?? () #1  <signal handler called> #2  0xb7f11d05 in ?? () #3  0xb7e75ed4 in list_delete_all_node () from /usr/lib/i386-linux-gnu/frr/libfrr.so.0 #4  0xb7e75f52 in list_delete () from /usr/lib/i386-linux-gnu/frr/libfrr.so.0 #5  0xb7e695ad in frr_pthread_finish () from /usr/lib/i386-linux-gnu/frr/libfrr.so.0 #6  0xb7e75778 in frr_fini () from /usr/lib/i386-linux-gnu/frr/libfrr.so.0 #7  0x004918ad in sigint () #8  0xb7e990b1 in quagga_sigevent_process () from /usr/lib/i386-linux-gnu/frr/libfrr.so.0 #9  0xb7ea6698 in thread_fetch () from /usr/lib/i386-linux-gnu/frr/libfrr.so.0 #10 0xb7e754ce in frr_run () from /usr/lib/i386-linux-gnu/frr/libfrr.so.0 #11 0x0048f491 in main ()
E   AssertionError: 
    r1: bgpd crashed. Core file found - Backtrace follows:
    [New LWP 6980]
    [New LWP 6990]
    [Thread debugging using libthread_db enabled]
    Using host libthread_db library "/lib/i386-linux-gnu/libthread_db.so.1".
    Core was generated by `/usr/lib/frr/bgpd'.
(15 more lines...)
Collapse Failed test_bfd_bgp_cbit_topo3 test_memory_leak History
Topology Tests on Ubuntu 16.04 amd64 3 secs
AssertionError:  r1: bgpd crashed. Core file found - Backtrace follows: [New LWP 29198] [New LWP 29202] [Thread debugging using libthread_db enabled] Using host libthread_db library "/lib/x86_64-linux-gnu/libthread_db.so.1". Core was generated by `/usr/lib/frr/bgpd'. Program terminated with signal SIGABRT, Aborted. #0  0x00007f641d4aa428 in __GI_raise (sig=sig@entry=6) at ../sysdeps/unix/sysv/linux/raise.c:54 [Current thread is 1 (Thread 0x7f641e4ed880 (LWP 29198))] #0  0x00007f641d4aa428 in __GI_raise (sig=sig@entry=6) at ../sysdeps/unix/sysv/linux/raise.c:54 #1  0x00007f641d4ac02a in __GI_abort () at abort.c:89 #2  0x00007f641e1e1250 in ?? () from /usr/lib/x86_64-linux-gnu/frr/libfrr.so.0 #3  <signal handler called> #4  __lll_lock_wait () at ../sysdeps/unix/sysv/linux/x86_64/lowlevellock.S:135 #5  0x00007f641d848dbd in __GI___pthread_mutex_lock (mutex=0x7f641e44f300) at ../nptl/pthread_mutex_lock.c:80 #6  0x00007f641e1b3cec in frr_pthread_destroy () from /usr/lib/x86_64-linux-gnu/frr/libfrr.so.0 #7  0x00007f641e1bfe0a in list_delete_all_node () from /usr/lib/x86_64-linux-gnu/frr/libfrr.so.0 #8  0x00007f641e1bfe79 in list_delete () from /usr/lib/x86_64-linux-gnu/frr/libfrr.so.0 #9  0x00007f641e1b3e1c in frr_pthread_finish () from /usr/lib/x86_64-linux-gnu/frr/libfrr.so.0 #10 0x00007f641e1bf6d2 in frr_fini () from /usr/lib/x86_64-linux-gnu/frr/libfrr.so.0 #11 0x000055ad6d27bd53 in sigint () #12 0x00007f641e1e12f3 in quagga_sigevent_process () from /usr/lib/x86_64-linux-gnu/frr/libfrr.so.0 #13 0x00007f641e1ee655 in thread_fetch () from /usr/lib/x86_64-linux-gnu/frr/libfrr.so.0 #14 0x00007f641e1bf413 in frr_run () from /usr/lib/x86_64-linux-gnu/frr/libfrr.so.0 #15 0x000055ad6d2799e1 in main ()
E   AssertionError: 
    r1: bgpd crashed. Core file found - Backtrace follows:
    [New LWP 29198]
    [New LWP 29202]
    [Thread debugging using libthread_db enabled]
    Using host libthread_db library "/lib/x86_64-linux-gnu/libthread_db.so.1".
    Core was generated by `/usr/lib/frr/bgpd'.
(19 more lines...)
Collapse Failed test_bfd_bgp_cbit_topo3 test_memory_leak History
Topology Tests on Ubuntu 18.04 amd64 3 secs
AssertionError:  r1: bgpd crashed. Core file found - Backtrace follows: [New LWP 6880] [New LWP 6884] [Thread debugging using libthread_db enabled] Using host libthread_db library "/lib/x86_64-linux-gnu/libthread_db.so.1". Core was generated by `/usr/lib/frr/bgpd'. Program terminated with signal SIGABRT, Aborted. #0  __GI_raise (sig=sig@entry=6) at ../sysdeps/unix/sysv/linux/raise.c:51 [Current thread is 1 (Thread 0x7f783777e7c0 (LWP 6880))] #0  __GI_raise (sig=sig@entry=6) at ../sysdeps/unix/sysv/linux/raise.c:51 #1  0x00007f7836607801 in __GI_abort () at abort.c:79 #2  0x00007f78373f17bf in ?? () from /usr/lib/x86_64-linux-gnu/frr/libfrr.so.0 #3  <signal handler called> #4  __lll_lock_wait () at ../sysdeps/unix/sysv/linux/x86_64/lowlevellock.S:135 #5  0x00007f78369c2023 in __GI___pthread_mutex_lock (mutex=0x7f783765f300) at ../nptl/pthread_mutex_lock.c:78 #6  0x00007f78373c41dc in frr_pthread_destroy () from /usr/lib/x86_64-linux-gnu/frr/libfrr.so.0 #7  0x00007f78373d040b in list_delete_all_node () from /usr/lib/x86_64-linux-gnu/frr/libfrr.so.0 #8  0x00007f78373d0479 in list_delete () from /usr/lib/x86_64-linux-gnu/frr/libfrr.so.0 #9  0x00007f78373c430c in frr_pthread_finish () from /usr/lib/x86_64-linux-gnu/frr/libfrr.so.0 #10 0x00007f78373cfcc2 in frr_fini () from /usr/lib/x86_64-linux-gnu/frr/libfrr.so.0 #11 0x0000564563f34cc9 in sigint () #12 0x00007f78373f1853 in quagga_sigevent_process () from /usr/lib/x86_64-linux-gnu/frr/libfrr.so.0 #13 0x00007f78373fe87d in thread_fetch () from /usr/lib/x86_64-linux-gnu/frr/libfrr.so.0 #14 0x00007f78373cf9f3 in frr_run () from /usr/lib/x86_64-linux-gnu/frr/libfrr.so.0 #15 0x0000564563f32961 in main ()
E   AssertionError: 
    r1: bgpd crashed. Core file found - Backtrace follows:
    [New LWP 6880]
    [New LWP 6884]
    [Thread debugging using libthread_db enabled]
    Using host libthread_db library "/lib/x86_64-linux-gnu/libthread_db.so.1".
    Core was generated by `/usr/lib/frr/bgpd'.
(19 more lines...)
Collapse Failed test_bfd_bgp_cbit_topo3 test_memory_leak History
TopoTest Tests on Ubuntu 16.04 i386 3 secs
AssertionError:  r1: bgpd crashed. Core file found - Backtrace follows: [New LWP 7750] [New LWP 7754] [Thread debugging using libthread_db enabled] Using host libthread_db library "/lib/i386-linux-gnu/libthread_db.so.1". Core was generated by `/usr/lib/frr/bgpd'. Program terminated with signal SIGABRT, Aborted. #0  0xb7f3dd05 in ?? () [Current thread is 1 (Thread 0xb788f7c0 (LWP 7750))] #0  0xb7f3dd05 in ?? () #1  <signal handler called> #2  0xb7f3dd05 in ?? () #3  0xb7ea1ed4 in list_delete_all_node () from /usr/lib/i386-linux-gnu/frr/libfrr.so.0 #4  0xb7ea1f52 in list_delete () from /usr/lib/i386-linux-gnu/frr/libfrr.so.0 #5  0xb7e955ad in frr_pthread_finish () from /usr/lib/i386-linux-gnu/frr/libfrr.so.0 #6  0xb7ea1778 in frr_fini () from /usr/lib/i386-linux-gnu/frr/libfrr.so.0 #7  0x004838ad in sigint () #8  0xb7ec50b1 in quagga_sigevent_process () from /usr/lib/i386-linux-gnu/frr/libfrr.so.0 #9  0xb7ed2698 in thread_fetch () from /usr/lib/i386-linux-gnu/frr/libfrr.so.0 #10 0xb7ea14ce in frr_run () from /usr/lib/i386-linux-gnu/frr/libfrr.so.0 #11 0x00481491 in main ()
E   AssertionError: 
    r1: bgpd crashed. Core file found - Backtrace follows:
    [New LWP 7750]
    [New LWP 7754]
    [Thread debugging using libthread_db enabled]
    Using host libthread_db library "/lib/i386-linux-gnu/libthread_db.so.1".
    Core was generated by `/usr/lib/frr/bgpd'.
(15 more lines...)
Collapse Failed test_bfd_topo1 test_memory_leak History
Topology Tests on Ubuntu 16.04 amd64 3 secs
AssertionError:  r4: bgpd crashed. Core file found - Backtrace follows: [New LWP 29987] [New LWP 29991] [Thread debugging using libthread_db enabled] Using host libthread_db library "/lib/x86_64-linux-gnu/libthread_db.so.1". Core was generated by `/usr/lib/frr/bgpd'. Program terminated with signal SIGABRT, Aborted. #0  0x00007f735f2b0428 in __GI_raise (sig=sig@entry=6) at ../sysdeps/unix/sysv/linux/raise.c:54 [Current thread is 1 (Thread 0x7f73602f3880 (LWP 29987))] #0  0x00007f735f2b0428 in __GI_raise (sig=sig@entry=6) at ../sysdeps/unix/sysv/linux/raise.c:54 #1  0x00007f735f2b202a in __GI_abort () at abort.c:89 #2  0x00007f735ffe7250 in ?? () from /usr/lib/x86_64-linux-gnu/frr/libfrr.so.0 #3  <signal handler called> #4  __lll_lock_wait () at ../sysdeps/unix/sysv/linux/x86_64/lowlevellock.S:135 #5  0x00007f735f64edbd in __GI___pthread_mutex_lock (mutex=0x7f7360255300) at ../nptl/pthread_mutex_lock.c:80 #6  0x00007f735ffb9cec in frr_pthread_destroy () from /usr/lib/x86_64-linux-gnu/frr/libfrr.so.0 #7  0x00007f735ffc5e0a in list_delete_all_node () from /usr/lib/x86_64-linux-gnu/frr/libfrr.so.0 #8  0x00007f735ffc5e79 in list_delete () from /usr/lib/x86_64-linux-gnu/frr/libfrr.so.0 #9  0x00007f735ffb9e1c in frr_pthread_finish () from /usr/lib/x86_64-linux-gnu/frr/libfrr.so.0 #10 0x00007f735ffc56d2 in frr_fini () from /usr/lib/x86_64-linux-gnu/frr/libfrr.so.0 #11 0x0000563e47f07d53 in sigint () #12 0x00007f735ffe72f3 in quagga_sigevent_process () from /usr/lib/x86_64-linux-gnu/frr/libfrr.so.0 #13 0x00007f735fff4655 in thread_fetch () from /usr/lib/x86_64-linux-gnu/frr/libfrr.so.0 #14 0x00007f735ffc5413 in frr_run () from /usr/lib/x86_64-linux-gnu/frr/libfrr.so.0 #15 0x0000563e47f059e1 in main ()
E   AssertionError: 
    r4: bgpd crashed. Core file found - Backtrace follows:
    [New LWP 29987]
    [New LWP 29991]
    [Thread debugging using libthread_db enabled]
    Using host libthread_db library "/lib/x86_64-linux-gnu/libthread_db.so.1".
    Core was generated by `/usr/lib/frr/bgpd'.
(19 more lines...)
Collapse Failed test_bfd_topo1 test_memory_leak History
Topology Tests on Ubuntu 18.04 amd64 3 secs
AssertionError:  r4: bgpd crashed. Core file found - Backtrace follows: [New LWP 7524] [New LWP 7528] [Thread debugging using libthread_db enabled] Using host libthread_db library "/lib/x86_64-linux-gnu/libthread_db.so.1". Core was generated by `/usr/lib/frr/bgpd'. Program terminated with signal SIGABRT, Aborted. #0  __GI_raise (sig=sig@entry=6) at ../sysdeps/unix/sysv/linux/raise.c:51 [Current thread is 1 (Thread 0x7f9b3274d7c0 (LWP 7524))] #0  __GI_raise (sig=sig@entry=6) at ../sysdeps/unix/sysv/linux/raise.c:51 #1  0x00007f9b315d1801 in __GI_abort () at abort.c:79 #2  0x00007f9b323bb7bf in ?? () from /usr/lib/x86_64-linux-gnu/frr/libfrr.so.0 #3  <signal handler called> #4  __lll_lock_wait () at ../sysdeps/unix/sysv/linux/x86_64/lowlevellock.S:135 #5  0x00007f9b3198c023 in __GI___pthread_mutex_lock (mutex=0x7f9b32629300) at ../nptl/pthread_mutex_lock.c:78 #6  0x00007f9b3238e1dc in frr_pthread_destroy () from /usr/lib/x86_64-linux-gnu/frr/libfrr.so.0 #7  0x00007f9b3239a40b in list_delete_all_node () from /usr/lib/x86_64-linux-gnu/frr/libfrr.so.0 #8  0x00007f9b3239a479 in list_delete () from /usr/lib/x86_64-linux-gnu/frr/libfrr.so.0 #9  0x00007f9b3238e30c in frr_pthread_finish () from /usr/lib/x86_64-linux-gnu/frr/libfrr.so.0 #10 0x00007f9b32399cc2 in frr_fini () from /usr/lib/x86_64-linux-gnu/frr/libfrr.so.0 #11 0x0000561e173cccc9 in sigint () #12 0x00007f9b323bb853 in quagga_sigevent_process () from /usr/lib/x86_64-linux-gnu/frr/libfrr.so.0 #13 0x00007f9b323c887d in thread_fetch () from /usr/lib/x86_64-linux-gnu/frr/libfrr.so.0 #14 0x00007f9b323999f3 in frr_run () from /usr/lib/x86_64-linux-gnu/frr/libfrr.so.0 #15 0x0000561e173ca961 in main ()
E   AssertionError: 
    r4: bgpd crashed. Core file found - Backtrace follows:
    [New LWP 7524]
    [New LWP 7528]
    [Thread debugging using libthread_db enabled]
    Using host libthread_db library "/lib/x86_64-linux-gnu/libthread_db.so.1".
    Core was generated by `/usr/lib/frr/bgpd'.
(19 more lines...)
Collapse Failed test_bfd_topo1 test_memory_leak History
TopoTest Tests on Ubuntu 16.04 i386 3 secs
AssertionError:  r4: bgpd crashed. Core file found - Backtrace follows: [New LWP 8530] [New LWP 8534] [Thread debugging using libthread_db enabled] Using host libthread_db library "/lib/i386-linux-gnu/libthread_db.so.1". Core was generated by `/usr/lib/frr/bgpd'. Program terminated with signal SIGABRT, Aborted. #0  0xb7eecd05 in ?? () [Current thread is 1 (Thread 0xb783e7c0 (LWP 8530))] #0  0xb7eecd05 in ?? () #1  <signal handler called> #2  0xb7eecd05 in ?? () #3  0xb7e50ed4 in list_delete_all_node () from /usr/lib/i386-linux-gnu/frr/libfrr.so.0 #4  0xb7e50f52 in list_delete () from /usr/lib/i386-linux-gnu/frr/libfrr.so.0 #5  0xb7e445ad in frr_pthread_finish () from /usr/lib/i386-linux-gnu/frr/libfrr.so.0 #6  0xb7e50778 in frr_fini () from /usr/lib/i386-linux-gnu/frr/libfrr.so.0 #7  0x004b38ad in sigint () #8  0xb7e740b1 in quagga_sigevent_process () from /usr/lib/i386-linux-gnu/frr/libfrr.so.0 #9  0xb7e81698 in thread_fetch () from /usr/lib/i386-linux-gnu/frr/libfrr.so.0 #10 0xb7e504ce in frr_run () from /usr/lib/i386-linux-gnu/frr/libfrr.so.0 #11 0x004b1491 in main ()
E   AssertionError: 
    r4: bgpd crashed. Core file found - Backtrace follows:
    [New LWP 8530]
    [New LWP 8534]
    [Thread debugging using libthread_db enabled]
    Using host libthread_db library "/lib/i386-linux-gnu/libthread_db.so.1".
    Core was generated by `/usr/lib/frr/bgpd'.
(15 more lines...)
Collapse Failed test_bfd_topo2 test_memory_leak History
Topology Tests on Ubuntu 16.04 amd64 3 secs
AssertionError:  r4: bgpd crashed. Core file found - Backtrace follows: [New LWP 30987] [New LWP 30993] [Thread debugging using libthread_db enabled] Using host libthread_db library "/lib/x86_64-linux-gnu/libthread_db.so.1". Core was generated by `/usr/lib/frr/bgpd'. Program terminated with signal SIGABRT, Aborted. #0  0x00007f7e2afd3428 in __GI_raise (sig=sig@entry=6) at ../sysdeps/unix/sysv/linux/raise.c:54 [Current thread is 1 (Thread 0x7f7e2c016880 (LWP 30987))] #0  0x00007f7e2afd3428 in __GI_raise (sig=sig@entry=6) at ../sysdeps/unix/sysv/linux/raise.c:54 #1  0x00007f7e2afd502a in __GI_abort () at abort.c:89 #2  0x00007f7e2bd0a250 in ?? () from /usr/lib/x86_64-linux-gnu/frr/libfrr.so.0 #3  <signal handler called> #4  __lll_lock_wait () at ../sysdeps/unix/sysv/linux/x86_64/lowlevellock.S:135 #5  0x00007f7e2b371dbd in __GI___pthread_mutex_lock (mutex=0x7f7e2bf78300) at ../nptl/pthread_mutex_lock.c:80 #6  0x00007f7e2bcdccec in frr_pthread_destroy () from /usr/lib/x86_64-linux-gnu/frr/libfrr.so.0 #7  0x00007f7e2bce8e0a in list_delete_all_node () from /usr/lib/x86_64-linux-gnu/frr/libfrr.so.0 #8  0x00007f7e2bce8e79 in list_delete () from /usr/lib/x86_64-linux-gnu/frr/libfrr.so.0 #9  0x00007f7e2bcdce1c in frr_pthread_finish () from /usr/lib/x86_64-linux-gnu/frr/libfrr.so.0 #10 0x00007f7e2bce86d2 in frr_fini () from /usr/lib/x86_64-linux-gnu/frr/libfrr.so.0 #11 0x00005649cff2bd53 in sigint () #12 0x00007f7e2bd0a2f3 in quagga_sigevent_process () from /usr/lib/x86_64-linux-gnu/frr/libfrr.so.0 #13 0x00007f7e2bd17655 in thread_fetch () from /usr/lib/x86_64-linux-gnu/frr/libfrr.so.0 #14 0x00007f7e2bce8413 in frr_run () from /usr/lib/x86_64-linux-gnu/frr/libfrr.so.0 #15 0x00005649cff299e1 in main ()
E   AssertionError: 
    r4: bgpd crashed. Core file found - Backtrace follows:
    [New LWP 30987]
    [New LWP 30993]
    [Thread debugging using libthread_db enabled]
    Using host libthread_db library "/lib/x86_64-linux-gnu/libthread_db.so.1".
    Core was generated by `/usr/lib/frr/bgpd'.
(19 more lines...)
Collapse Failed test_bfd_topo2 test_memory_leak History
Topology Tests on Ubuntu 18.04 amd64 3 secs
AssertionError:  r4: bgpd crashed. Core file found - Backtrace follows: [New LWP 8366] [New LWP 8372] [Thread debugging using libthread_db enabled] Using host libthread_db library "/lib/x86_64-linux-gnu/libthread_db.so.1". Core was generated by `/usr/lib/frr/bgpd'. Program terminated with signal SIGABRT, Aborted. #0  __GI_raise (sig=sig@entry=6) at ../sysdeps/unix/sysv/linux/raise.c:51 [Current thread is 1 (Thread 0x7f80452a27c0 (LWP 8366))] #0  __GI_raise (sig=sig@entry=6) at ../sysdeps/unix/sysv/linux/raise.c:51 #1  0x00007f8044126801 in __GI_abort () at abort.c:79 #2  0x00007f8044f107bf in ?? () from /usr/lib/x86_64-linux-gnu/frr/libfrr.so.0 #3  <signal handler called> #4  __lll_lock_wait () at ../sysdeps/unix/sysv/linux/x86_64/lowlevellock.S:135 #5  0x00007f80444e1023 in __GI___pthread_mutex_lock (mutex=0x7f804517e300) at ../nptl/pthread_mutex_lock.c:78 #6  0x00007f8044ee31dc in frr_pthread_destroy () from /usr/lib/x86_64-linux-gnu/frr/libfrr.so.0 #7  0x00007f8044eef40b in list_delete_all_node () from /usr/lib/x86_64-linux-gnu/frr/libfrr.so.0 #8  0x00007f8044eef479 in list_delete () from /usr/lib/x86_64-linux-gnu/frr/libfrr.so.0 #9  0x00007f8044ee330c in frr_pthread_finish () from /usr/lib/x86_64-linux-gnu/frr/libfrr.so.0 #10 0x00007f8044eeecc2 in frr_fini () from /usr/lib/x86_64-linux-gnu/frr/libfrr.so.0 #11 0x0000555df5e80cc9 in sigint () #12 0x00007f8044f10853 in quagga_sigevent_process () from /usr/lib/x86_64-linux-gnu/frr/libfrr.so.0 #13 0x00007f8044f1d87d in thread_fetch () from /usr/lib/x86_64-linux-gnu/frr/libfrr.so.0 #14 0x00007f8044eee9f3 in frr_run () from /usr/lib/x86_64-linux-gnu/frr/libfrr.so.0 #15 0x0000555df5e7e961 in main ()
E   AssertionError: 
    r4: bgpd crashed. Core file found - Backtrace follows:
    [New LWP 8366]
    [New LWP 8372]
    [Thread debugging using libthread_db enabled]
    Using host libthread_db library "/lib/x86_64-linux-gnu/libthread_db.so.1".
    Core was generated by `/usr/lib/frr/bgpd'.
(19 more lines...)
Collapse Failed test_bfd_topo2 test_memory_leak History
TopoTest Tests on Ubuntu 16.04 i386 3 secs
AssertionError:  r4: bgpd crashed. Core file found - Backtrace follows: [New LWP 9500] [New LWP 9506] [Thread debugging using libthread_db enabled] Using host libthread_db library "/lib/i386-linux-gnu/libthread_db.so.1". Core was generated by `/usr/lib/frr/bgpd'. Program terminated with signal SIGABRT, Aborted. #0  0xb7f57d05 in ?? () [Current thread is 1 (Thread 0xb78a97c0 (LWP 9500))] #0  0xb7f57d05 in ?? () #1  <signal handler called> #2  0xb7f57d05 in ?? () #3  0xb7ebbed4 in list_delete_all_node () from /usr/lib/i386-linux-gnu/frr/libfrr.so.0 #4  0xb7ebbf52 in list_delete () from /usr/lib/i386-linux-gnu/frr/libfrr.so.0 #5  0xb7eaf5ad in frr_pthread_finish () from /usr/lib/i386-linux-gnu/frr/libfrr.so.0 #6  0xb7ebb778 in frr_fini () from /usr/lib/i386-linux-gnu/frr/libfrr.so.0 #7  0x004968ad in sigint () #8  0xb7edf0b1 in quagga_sigevent_process () from /usr/lib/i386-linux-gnu/frr/libfrr.so.0 #9  0xb7eec698 in thread_fetch () from /usr/lib/i386-linux-gnu/frr/libfrr.so.0 #10 0xb7ebb4ce in frr_run () from /usr/lib/i386-linux-gnu/frr/libfrr.so.0 #11 0x00494491 in main ()
E   AssertionError: 
    r4: bgpd crashed. Core file found - Backtrace follows:
    [New LWP 9500]
    [New LWP 9506]
    [Thread debugging using libthread_db enabled]
    Using host libthread_db library "/lib/i386-linux-gnu/libthread_db.so.1".
    Core was generated by `/usr/lib/frr/bgpd'.
(15 more lines...)
Collapse Failed test_bfd_vrf_topo1 test_memory_leak History
Topology Tests on Ubuntu 16.04 amd64 3 secs
AssertionError:  r4: bgpd crashed. Core file found - Backtrace follows: [New LWP 32317] [New LWP 32321] [Thread debugging using libthread_db enabled] Using host libthread_db library "/lib/x86_64-linux-gnu/libthread_db.so.1". Core was generated by `/usr/lib/frr/bgpd'. Program terminated with signal SIGABRT, Aborted. #0  0x00007f4f3e40c428 in __GI_raise (sig=sig@entry=6) at ../sysdeps/unix/sysv/linux/raise.c:54 [Current thread is 1 (Thread 0x7f4f3f44f880 (LWP 32317))] #0  0x00007f4f3e40c428 in __GI_raise (sig=sig@entry=6) at ../sysdeps/unix/sysv/linux/raise.c:54 #1  0x00007f4f3e40e02a in __GI_abort () at abort.c:89 #2  0x00007f4f3f143250 in ?? () from /usr/lib/x86_64-linux-gnu/frr/libfrr.so.0 #3  <signal handler called> #4  __lll_lock_wait () at ../sysdeps/unix/sysv/linux/x86_64/lowlevellock.S:135 #5  0x00007f4f3e7aadbd in __GI___pthread_mutex_lock (mutex=0x7f4f3f3b1300) at ../nptl/pthread_mutex_lock.c:80 #6  0x00007f4f3f115cec in frr_pthread_destroy () from /usr/lib/x86_64-linux-gnu/frr/libfrr.so.0 #7  0x00007f4f3f121e0a in list_delete_all_node () from /usr/lib/x86_64-linux-gnu/frr/libfrr.so.0 #8  0x00007f4f3f121e79 in list_delete () from /usr/lib/x86_64-linux-gnu/frr/libfrr.so.0 #9  0x00007f4f3f115e1c in frr_pthread_finish () from /usr/lib/x86_64-linux-gnu/frr/libfrr.so.0 #10 0x00007f4f3f1216d2 in frr_fini () from /usr/lib/x86_64-linux-gnu/frr/libfrr.so.0 #11 0x000055563be70d53 in sigint () #12 0x00007f4f3f1432f3 in quagga_sigevent_process () from /usr/lib/x86_64-linux-gnu/frr/libfrr.so.0 #13 0x00007f4f3f150655 in thread_fetch () from /usr/lib/x86_64-linux-gnu/frr/libfrr.so.0 #14 0x00007f4f3f121413 in frr_run () from /usr/lib/x86_64-linux-gnu/frr/libfrr.so.0 #15 0x000055563be6e9e1 in main ()
E   AssertionError: 
    r4: bgpd crashed. Core file found - Backtrace follows:
    [New LWP 32317]
    [New LWP 32321]
    [Thread debugging using libthread_db enabled]
    Using host libthread_db library "/lib/x86_64-linux-gnu/libthread_db.so.1".
    Core was generated by `/usr/lib/frr/bgpd'.
(19 more lines...)
Collapse Failed test_bfd_vrf_topo1 test_memory_leak History
Topology Tests on Ubuntu 18.04 amd64 3 secs
AssertionError:  r4: bgpd crashed. Core file found - Backtrace follows: [New LWP 9545] [New LWP 9549] [Thread debugging using libthread_db enabled] Using host libthread_db library "/lib/x86_64-linux-gnu/libthread_db.so.1". Core was generated by `/usr/lib/frr/bgpd'. Program terminated with signal SIGABRT, Aborted. #0  __GI_raise (sig=sig@entry=6) at ../sysdeps/unix/sysv/linux/raise.c:51 [Current thread is 1 (Thread 0x7ff8f6e107c0 (LWP 9545))] #0  __GI_raise (sig=sig@entry=6) at ../sysdeps/unix/sysv/linux/raise.c:51 #1  0x00007ff8f5c94801 in __GI_abort () at abort.c:79 #2  0x00007ff8f6a7e7bf in ?? () from /usr/lib/x86_64-linux-gnu/frr/libfrr.so.0 #3  <signal handler called> #4  __lll_lock_wait () at ../sysdeps/unix/sysv/linux/x86_64/lowlevellock.S:135 #5  0x00007ff8f604f023 in __GI___pthread_mutex_lock (mutex=0x7ff8f6cec300) at ../nptl/pthread_mutex_lock.c:78 #6  0x00007ff8f6a511dc in frr_pthread_destroy () from /usr/lib/x86_64-linux-gnu/frr/libfrr.so.0 #7  0x00007ff8f6a5d40b in list_delete_all_node () from /usr/lib/x86_64-linux-gnu/frr/libfrr.so.0 #8  0x00007ff8f6a5d479 in list_delete () from /usr/lib/x86_64-linux-gnu/frr/libfrr.so.0 #9  0x00007ff8f6a5130c in frr_pthread_finish () from /usr/lib/x86_64-linux-gnu/frr/libfrr.so.0 #10 0x00007ff8f6a5ccc2 in frr_fini () from /usr/lib/x86_64-linux-gnu/frr/libfrr.so.0 #11 0x000055d50b71dcc9 in sigint () #12 0x00007ff8f6a7e853 in quagga_sigevent_process () from /usr/lib/x86_64-linux-gnu/frr/libfrr.so.0 #13 0x00007ff8f6a8b87d in thread_fetch () from /usr/lib/x86_64-linux-gnu/frr/libfrr.so.0 #14 0x00007ff8f6a5c9f3 in frr_run () from /usr/lib/x86_64-linux-gnu/frr/libfrr.so.0 #15 0x000055d50b71b961 in main ()
E   AssertionError: 
    r4: bgpd crashed. Core file found - Backtrace follows:
    [New LWP 9545]
    [New LWP 9549]
    [Thread debugging using libthread_db enabled]
    Using host libthread_db library "/lib/x86_64-linux-gnu/libthread_db.so.1".
    Core was generated by `/usr/lib/frr/bgpd'.
(19 more lines...)
Collapse Failed test_bfd_vrf_topo1 test_memory_leak History
TopoTest Tests on Ubuntu 16.04 i386 3 secs
AssertionError:  r4: bgpd crashed. Core file found - Backtrace follows: [New LWP 10812] [New LWP 10816] [Thread debugging using libthread_db enabled] Using host libthread_db library "/lib/i386-linux-gnu/libthread_db.so.1". Core was generated by `/usr/lib/frr/bgpd'. Program terminated with signal SIGABRT, Aborted. #0  0xb7f77d05 in ?? () [Current thread is 1 (Thread 0xb78c97c0 (LWP 10812))] #0  0xb7f77d05 in ?? () #1  <signal handler called> #2  0xb7f77d05 in ?? () #3  0xb7edbed4 in list_delete_all_node () from /usr/lib/i386-linux-gnu/frr/libfrr.so.0 #4  0xb7edbf52 in list_delete () from /usr/lib/i386-linux-gnu/frr/libfrr.so.0 #5  0xb7ecf5ad in frr_pthread_finish () from /usr/lib/i386-linux-gnu/frr/libfrr.so.0 #6  0xb7edb778 in frr_fini () from /usr/lib/i386-linux-gnu/frr/libfrr.so.0 #7  0x0047f8ad in sigint () #8  0xb7eff0b1 in quagga_sigevent_process () from /usr/lib/i386-linux-gnu/frr/libfrr.so.0 #9  0xb7f0c698 in thread_fetch () from /usr/lib/i386-linux-gnu/frr/libfrr.so.0 #10 0xb7edb4ce in frr_run () from /usr/lib/i386-linux-gnu/frr/libfrr.so.0 #11 0x0047d491 in main ()
E   AssertionError: 
    r4: bgpd crashed. Core file found - Backtrace follows:
    [New LWP 10812]
    [New LWP 10816]
    [Thread debugging using libthread_db enabled]
    Using host libthread_db library "/lib/i386-linux-gnu/libthread_db.so.1".
    Core was generated by `/usr/lib/frr/bgpd'.
(15 more lines...)
Collapse Failed test_bgp_basic_functionality test_bgp_with_loopback_interface History
Topology Tests on Ubuntu 16.04 amd64 14 secs
test teardown failure
E   AssertionError: 
    r4: bgpd crashed. Core file found - Backtrace follows:
    [New LWP 843]
    [New LWP 846]
    [Thread debugging using libthread_db enabled]
    Using host libthread_db library "/lib/x86_64-linux-gnu/libthread_db.so.1".
    Core was generated by `/usr/lib/frr/bgpd'.
(97 more lines...)
Collapse Failed test_bgp_basic_functionality test_bgp_with_loopback_interface History
Topology Tests on Ubuntu 18.04 amd64 15 secs
test teardown failure
E   AssertionError: 
    r4: bgpd crashed. Core file found - Backtrace follows:
    [New LWP 10412]
    [New LWP 10415]
    [Thread debugging using libthread_db enabled]
    Using host libthread_db library "/lib/x86_64-linux-gnu/libthread_db.so.1".
    Core was generated by `/usr/lib/frr/bgpd'.
(97 more lines...)
Collapse Failed test_bgp_basic_functionality test_bgp_with_loopback_interface History
TopoTest Tests on Ubuntu 16.04 i386 15 secs
test teardown failure
E   AssertionError: 
    r4: bgpd crashed. Core file found - Backtrace follows:
    [New LWP 11591]
    [New LWP 11594]
    [Thread debugging using libthread_db enabled]
    Using host libthread_db library "/lib/i386-linux-gnu/libthread_db.so.1".
    Core was generated by `/usr/lib/frr/bgpd'.
(81 more lines...)
Collapse Failed test_bgp_comm-list_delete test_bgp_maximum_prefix_invalid History
Topology Tests on Ubuntu 16.04 amd64 13 secs
test teardown failure
E   AssertionError: 
    r1: bgpd crashed. Core file found - Backtrace follows:
    [New LWP 7886]
    [New LWP 7889]
    [Thread debugging using libthread_db enabled]
    Using host libthread_db library "/lib/x86_64-linux-gnu/libthread_db.so.1".
    Core was generated by `/usr/lib/frr/bgpd'.
(45 more lines...)
Collapse Failed test_bgp_comm-list_delete test_bgp_maximum_prefix_invalid History
Topology Tests on Ubuntu 18.04 amd64 14 secs
test teardown failure
E   AssertionError: 
    r1: bgpd crashed. Core file found - Backtrace follows:
    [New LWP 16851]
    [New LWP 16854]
    [Thread debugging using libthread_db enabled]
    Using host libthread_db library "/lib/x86_64-linux-gnu/libthread_db.so.1".
    Core was generated by `/usr/lib/frr/bgpd'.
(45 more lines...)
Collapse Failed test_bgp_comm-list_delete test_bgp_maximum_prefix_invalid History
TopoTest Tests on Ubuntu 16.04 i386 14 secs
test teardown failure
E   AssertionError: 
    r1: bgpd crashed. Core file found - Backtrace follows:
    [New LWP 18495]
    [New LWP 18498]
    [Thread debugging using libthread_db enabled]
    Using host libthread_db library "/lib/i386-linux-gnu/libthread_db.so.1".
    Core was generated by `/usr/lib/frr/bgpd'.
(37 more lines...)
Collapse Failed test_bgp_ebgp_requires_policy test_bgp_remove_private_as History
Topology Tests on Ubuntu 16.04 amd64 25 secs
test teardown failure
E   AssertionError: 
    r4: bgpd crashed. Core file found - Backtrace follows:
    [New LWP 8455]
    [New LWP 8458]
    [Thread debugging using libthread_db enabled]
    Using host libthread_db library "/lib/x86_64-linux-gnu/libthread_db.so.1".
    Core was generated by `/usr/lib/frr/bgpd'.
(97 more lines...)
Collapse Failed test_bgp_ebgp_requires_policy test_bgp_remove_private_as History
Topology Tests on Ubuntu 18.04 amd64 26 secs
test teardown failure
E   AssertionError: 
    r4: bgpd crashed. Core file found - Backtrace follows:
    [New LWP 17312]
    [New LWP 17315]
    [Thread debugging using libthread_db enabled]
    Using host libthread_db library "/lib/x86_64-linux-gnu/libthread_db.so.1".
    Core was generated by `/usr/lib/frr/bgpd'.
(97 more lines...)
Collapse Failed test_bgp_ebgp_requires_policy test_bgp_remove_private_as History
TopoTest Tests on Ubuntu 16.04 i386 24 secs
test teardown failure
E   AssertionError: 
    r4: bgpd crashed. Core file found - Backtrace follows:
    [New LWP 19097]
    [New LWP 19100]
    [Thread debugging using libthread_db enabled]
    Using host libthread_db library "/lib/i386-linux-gnu/libthread_db.so.1".
    Core was generated by `/usr/lib/frr/bgpd'.
(81 more lines...)
Collapse Failed test_bgp_ecmp_topo1 test_bgp_ecmp History
Topology Tests on Ubuntu 16.04 amd64 2 secs
test teardown failure
E   AssertionError: 
    r1: bgpd crashed. Core file found - Backtrace follows:
    [New LWP 2984]
    [New LWP 2987]
    [Thread debugging using libthread_db enabled]
    Using host libthread_db library "/lib/x86_64-linux-gnu/libthread_db.so.1".
    Core was generated by `/usr/lib/frr/bgpd'.
(19 more lines...)
Collapse Failed test_bgp_ecmp_topo1 test_bgp_ecmp History
Topology Tests on Ubuntu 18.04 amd64 3 secs
test teardown failure
E   AssertionError: 
    r1: bgpd crashed. Core file found - Backtrace follows:
    [New LWP 12080]
    [New LWP 12083]
    [Thread debugging using libthread_db enabled]
    Using host libthread_db library "/lib/x86_64-linux-gnu/libthread_db.so.1".
    Core was generated by `/usr/lib/frr/bgpd'.
(19 more lines...)
Collapse Failed test_bgp_ecmp_topo1 test_bgp_ecmp History
TopoTest Tests on Ubuntu 16.04 i386 2 secs
test teardown failure
E   AssertionError: 
    r1: bgpd crashed. Core file found - Backtrace follows:
    [New LWP 13618]
    [New LWP 13621]
    [Thread debugging using libthread_db enabled]
    Using host libthread_db library "/lib/i386-linux-gnu/libthread_db.so.1".
    Core was generated by `/usr/lib/frr/bgpd'.
(15 more lines...)
Collapse Failed test_bgp_instance_del_test test_memory_leak History
Topology Tests on Ubuntu 16.04 amd64 4 secs
AssertionError:  r4: bgpd crashed. Core file found - Backtrace follows: [New LWP 9395] [New LWP 9403] [Thread debugging using libthread_db enabled] Using host libthread_db library "/lib/x86_64-linux-gnu/libthread_db.so.1". Core was generated by `/usr/lib/frr/bgpd'. Program terminated with signal SIGABRT, Aborted. #0  0x00007fe069e49428 in __GI_raise (sig=sig@entry=6) at ../sysdeps/unix/sysv/linux/raise.c:54 [Current thread is 1 (Thread 0x7fe06ae8c880 (LWP 9395))] #0  0x00007fe069e49428 in __GI_raise (sig=sig@entry=6) at ../sysdeps/unix/sysv/linux/raise.c:54 #1  0x00007fe069e4b02a in __GI_abort () at abort.c:89 #2  0x00007fe06ab80250 in ?? () from /usr/lib/x86_64-linux-gnu/frr/libfrr.so.0 #3  <signal handler called> #4  __lll_lock_wait () at ../sysdeps/unix/sysv/linux/x86_64/lowlevellock.S:135 #5  0x00007fe06a1e7dbd in __GI___pthread_mutex_lock (mutex=0x7fe06adee300) at ../nptl/pthread_mutex_lock.c:80 #6  0x00007fe06ab52cec in frr_pthread_destroy () from /usr/lib/x86_64-linux-gnu/frr/libfrr.so.0 #7  0x00007fe06ab5ee0a in list_delete_all_node () from /usr/lib/x86_64-linux-gnu/frr/libfrr.so.0 #8  0x00007fe06ab5ee79 in list_delete () from /usr/lib/x86_64-linux-gnu/frr/libfrr.so.0 #9  0x00007fe06ab52e1c in frr_pthread_finish () from /usr/lib/x86_64-linux-gnu/frr/libfrr.so.0 #10 0x00007fe06ab5e6d2 in frr_fini () from /usr/lib/x86_64-linux-gnu/frr/libfrr.so.0 #11 0x000055bd8498ed53 in sigint () #12 0x00007fe06ab802f3 in quagga_sigevent_process () from /usr/lib/x86_64-linux-gnu/frr/libfrr.so.0 #13 0x00007fe06ab8d655 in thread_fetch () from /usr/lib/x86_64-linux-gnu/frr/libfrr.so.0 #14 0x00007fe06ab5e413 in frr_run () from /usr/lib/x86_64-linux-gnu/frr/libfrr.so.0 #15 0x000055bd8498c9e1 in main ()
E   AssertionError: 
    r4: bgpd crashed. Core file found - Backtrace follows:
    [New LWP 9395]
    [New LWP 9403]
    [Thread debugging using libthread_db enabled]
    Using host libthread_db library "/lib/x86_64-linux-gnu/libthread_db.so.1".
    Core was generated by `/usr/lib/frr/bgpd'.
(19 more lines...)
Collapse Failed test_bgp_instance_del_test test_memory_leak History
Topology Tests on Ubuntu 18.04 amd64 4 secs
AssertionError:  r4: bgpd crashed. Core file found - Backtrace follows: [New LWP 18089] [New LWP 18096] [Thread debugging using libthread_db enabled] Using host libthread_db library "/lib/x86_64-linux-gnu/libthread_db.so.1". Core was generated by `/usr/lib/frr/bgpd'. Program terminated with signal SIGABRT, Aborted. #0  __GI_raise (sig=sig@entry=6) at ../sysdeps/unix/sysv/linux/raise.c:51 [Current thread is 1 (Thread 0x7f0112e7f7c0 (LWP 18089))] #0  __GI_raise (sig=sig@entry=6) at ../sysdeps/unix/sysv/linux/raise.c:51 #1  0x00007f0111d03801 in __GI_abort () at abort.c:79 #2  0x00007f0112aed7bf in ?? () from /usr/lib/x86_64-linux-gnu/frr/libfrr.so.0 #3  <signal handler called> #4  __lll_lock_wait () at ../sysdeps/unix/sysv/linux/x86_64/lowlevellock.S:135 #5  0x00007f01120be023 in __GI___pthread_mutex_lock (mutex=0x7f0112d5b300) at ../nptl/pthread_mutex_lock.c:78 #6  0x00007f0112ac01dc in frr_pthread_destroy () from /usr/lib/x86_64-linux-gnu/frr/libfrr.so.0 #7  0x00007f0112acc40b in list_delete_all_node () from /usr/lib/x86_64-linux-gnu/frr/libfrr.so.0 #8  0x00007f0112acc479 in list_delete () from /usr/lib/x86_64-linux-gnu/frr/libfrr.so.0 #9  0x00007f0112ac030c in frr_pthread_finish () from /usr/lib/x86_64-linux-gnu/frr/libfrr.so.0 #10 0x00007f0112acbcc2 in frr_fini () from /usr/lib/x86_64-linux-gnu/frr/libfrr.so.0 #11 0x00005648850ddcc9 in sigint () #12 0x00007f0112aed853 in quagga_sigevent_process () from /usr/lib/x86_64-linux-gnu/frr/libfrr.so.0 #13 0x00007f0112afa87d in thread_fetch () from /usr/lib/x86_64-linux-gnu/frr/libfrr.so.0 #14 0x00007f0112acb9f3 in frr_run () from /usr/lib/x86_64-linux-gnu/frr/libfrr.so.0 #15 0x00005648850db961 in main ()
E   AssertionError: 
    r4: bgpd crashed. Core file found - Backtrace follows:
    [New LWP 18089]
    [New LWP 18096]
    [Thread debugging using libthread_db enabled]
    Using host libthread_db library "/lib/x86_64-linux-gnu/libthread_db.so.1".
    Core was generated by `/usr/lib/frr/bgpd'.
(19 more lines...)
Collapse Failed test_bgp_instance_del_test test_memory_leak History
TopoTest Tests on Ubuntu 16.04 i386 4 secs
AssertionError:  r4: bgpd crashed. Core file found - Backtrace follows: [New LWP 20009] [New LWP 20016] [Thread debugging using libthread_db enabled] Using host libthread_db library "/lib/i386-linux-gnu/libthread_db.so.1". Core was generated by `/usr/lib/frr/bgpd'. Program terminated with signal SIGABRT, Aborted. #0  0xb7fb8d05 in ?? () [Current thread is 1 (Thread 0xb790a7c0 (LWP 20009))] #0  0xb7fb8d05 in ?? () #1  <signal handler called> #2  0xb7fb8d05 in ?? () #3  0xb7f1ced4 in list_delete_all_node () from /usr/lib/i386-linux-gnu/frr/libfrr.so.0 #4  0xb7f1cf52 in list_delete () from /usr/lib/i386-linux-gnu/frr/libfrr.so.0 #5  0xb7f105ad in frr_pthread_finish () from /usr/lib/i386-linux-gnu/frr/libfrr.so.0 #6  0xb7f1c778 in frr_fini () from /usr/lib/i386-linux-gnu/frr/libfrr.so.0 #7  0x004c68ad in sigint () #8  0xb7f400b1 in quagga_sigevent_process () from /usr/lib/i386-linux-gnu/frr/libfrr.so.0 #9  0xb7f4d698 in thread_fetch () from /usr/lib/i386-linux-gnu/frr/libfrr.so.0 #10 0xb7f1c4ce in frr_run () from /usr/lib/i386-linux-gnu/frr/libfrr.so.0 #11 0x004c4491 in main ()
E   AssertionError: 
    r4: bgpd crashed. Core file found - Backtrace follows:
    [New LWP 20009]
    [New LWP 20016]
    [Thread debugging using libthread_db enabled]
    Using host libthread_db library "/lib/i386-linux-gnu/libthread_db.so.1".
    Core was generated by `/usr/lib/frr/bgpd'.
(15 more lines...)
Collapse Failed test_bgp_ipv6_rtadv test_memory_leak History
Topology Tests on Ubuntu 16.04 amd64 2 secs
AssertionError:  r1: bgpd crashed. Core file found - Backtrace follows: [New LWP 11029] [New LWP 11032] [Thread debugging using libthread_db enabled] Using host libthread_db library "/lib/x86_64-linux-gnu/libthread_db.so.1". Core was generated by `/usr/lib/frr/bgpd'. Program terminated with signal SIGABRT, Aborted. #0  0x00007f8bb4637428 in __GI_raise (sig=sig@entry=6) at ../sysdeps/unix/sysv/linux/raise.c:54 [Current thread is 1 (Thread 0x7f8bb567a880 (LWP 11029))] #0  0x00007f8bb4637428 in __GI_raise (sig=sig@entry=6) at ../sysdeps/unix/sysv/linux/raise.c:54 #1  0x00007f8bb463902a in __GI_abort () at abort.c:89 #2  0x00007f8bb536e250 in ?? () from /usr/lib/x86_64-linux-gnu/frr/libfrr.so.0 #3  <signal handler called> #4  __lll_lock_wait () at ../sysdeps/unix/sysv/linux/x86_64/lowlevellock.S:135 #5  0x00007f8bb49d5dbd in __GI___pthread_mutex_lock (mutex=0x7f8bb55dc300) at ../nptl/pthread_mutex_lock.c:80 #6  0x00007f8bb5340cec in frr_pthread_destroy () from /usr/lib/x86_64-linux-gnu/frr/libfrr.so.0 #7  0x00007f8bb534ce0a in list_delete_all_node () from /usr/lib/x86_64-linux-gnu/frr/libfrr.so.0 #8  0x00007f8bb534ce79 in list_delete () from /usr/lib/x86_64-linux-gnu/frr/libfrr.so.0 #9  0x00007f8bb5340e1c in frr_pthread_finish () from /usr/lib/x86_64-linux-gnu/frr/libfrr.so.0 #10 0x00007f8bb534c6d2 in frr_fini () from /usr/lib/x86_64-linux-gnu/frr/libfrr.so.0 #11 0x000055eaa198fd53 in sigint () #12 0x00007f8bb536e2f3 in quagga_sigevent_process () from /usr/lib/x86_64-linux-gnu/frr/libfrr.so.0 #13 0x00007f8bb537b655 in thread_fetch () from /usr/lib/x86_64-linux-gnu/frr/libfrr.so.0 #14 0x00007f8bb534c413 in frr_run () from /usr/lib/x86_64-linux-gnu/frr/libfrr.so.0 #15 0x000055eaa198d9e1 in main ()
E   AssertionError: 
    r1: bgpd crashed. Core file found - Backtrace follows:
    [New LWP 11029]
    [New LWP 11032]
    [Thread debugging using libthread_db enabled]
    Using host libthread_db library "/lib/x86_64-linux-gnu/libthread_db.so.1".
    Core was generated by `/usr/lib/frr/bgpd'.
(19 more lines...)
Collapse Failed test_bgp_ipv6_rtadv test_memory_leak History
Topology Tests on Ubuntu 18.04 amd64 3 secs
AssertionError:  r1: bgpd crashed. Core file found - Backtrace follows: [New LWP 19695] [New LWP 19698] [Thread debugging using libthread_db enabled] Using host libthread_db library "/lib/x86_64-linux-gnu/libthread_db.so.1". Core was generated by `/usr/lib/frr/bgpd'. Program terminated with signal SIGABRT, Aborted. #0  __GI_raise (sig=sig@entry=6) at ../sysdeps/unix/sysv/linux/raise.c:51 [Current thread is 1 (Thread 0x7f98d93a47c0 (LWP 19695))] #0  __GI_raise (sig=sig@entry=6) at ../sysdeps/unix/sysv/linux/raise.c:51 #1  0x00007f98d8228801 in __GI_abort () at abort.c:79 #2  0x00007f98d90127bf in ?? () from /usr/lib/x86_64-linux-gnu/frr/libfrr.so.0 #3  <signal handler called> #4  __lll_lock_wait () at ../sysdeps/unix/sysv/linux/x86_64/lowlevellock.S:135 #5  0x00007f98d85e3023 in __GI___pthread_mutex_lock (mutex=0x7f98d9280300) at ../nptl/pthread_mutex_lock.c:78 #6  0x00007f98d8fe51dc in frr_pthread_destroy () from /usr/lib/x86_64-linux-gnu/frr/libfrr.so.0 #7  0x00007f98d8ff140b in list_delete_all_node () from /usr/lib/x86_64-linux-gnu/frr/libfrr.so.0 #8  0x00007f98d8ff1479 in list_delete () from /usr/lib/x86_64-linux-gnu/frr/libfrr.so.0 #9  0x00007f98d8fe530c in frr_pthread_finish () from /usr/lib/x86_64-linux-gnu/frr/libfrr.so.0 #10 0x00007f98d8ff0cc2 in frr_fini () from /usr/lib/x86_64-linux-gnu/frr/libfrr.so.0 #11 0x000055d0d6867cc9 in sigint () #12 0x00007f98d9012853 in quagga_sigevent_process () from /usr/lib/x86_64-linux-gnu/frr/libfrr.so.0 #13 0x00007f98d901f87d in thread_fetch () from /usr/lib/x86_64-linux-gnu/frr/libfrr.so.0 #14 0x00007f98d8ff09f3 in frr_run () from /usr/lib/x86_64-linux-gnu/frr/libfrr.so.0 #15 0x000055d0d6865961 in main ()
E   AssertionError: 
    r1: bgpd crashed. Core file found - Backtrace follows:
    [New LWP 19695]
    [New LWP 19698]
    [Thread debugging using libthread_db enabled]
    Using host libthread_db library "/lib/x86_64-linux-gnu/libthread_db.so.1".
    Core was generated by `/usr/lib/frr/bgpd'.
(19 more lines...)
Collapse Failed test_bgp_ipv6_rtadv test_memory_leak History
TopoTest Tests on Ubuntu 16.04 i386 2 secs
AssertionError:  r1: bgpd crashed. Core file found - Backtrace follows: [New LWP 21612] [New LWP 21615] [Thread debugging using libthread_db enabled] Using host libthread_db library "/lib/i386-linux-gnu/libthread_db.so.1". Core was generated by `/usr/lib/frr/bgpd'. Program terminated with signal SIGABRT, Aborted. #0  0xb7eefd05 in ?? () [Current thread is 1 (Thread 0xb78417c0 (LWP 21612))] #0  0xb7eefd05 in ?? () #1  <signal handler called> #2  0xb7eefd05 in ?? () #3  0xb7e53ed4 in list_delete_all_node () from /usr/lib/i386-linux-gnu/frr/libfrr.so.0 #4  0xb7e53f52 in list_delete () from /usr/lib/i386-linux-gnu/frr/libfrr.so.0 #5  0xb7e475ad in frr_pthread_finish () from /usr/lib/i386-linux-gnu/frr/libfrr.so.0 #6  0xb7e53778 in frr_fini () from /usr/lib/i386-linux-gnu/frr/libfrr.so.0 #7  0x004518ad in sigint () #8  0xb7e770b1 in quagga_sigevent_process () from /usr/lib/i386-linux-gnu/frr/libfrr.so.0 #9  0xb7e84698 in thread_fetch () from /usr/lib/i386-linux-gnu/frr/libfrr.so.0 #10 0xb7e534ce in frr_run () from /usr/lib/i386-linux-gnu/frr/libfrr.so.0 #11 0x0044f491 in main ()
E   AssertionError: 
    r1: bgpd crashed. Core file found - Backtrace follows:
    [New LWP 21612]
    [New LWP 21615]
    [Thread debugging using libthread_db enabled]
    Using host libthread_db library "/lib/i386-linux-gnu/libthread_db.so.1".
    Core was generated by `/usr/lib/frr/bgpd'.
(15 more lines...)
Collapse Failed test_bgp_l3vpn_to_bgp_direct test_memory_leak History
Topology Tests on Ubuntu 16.04 amd64 4 secs
AssertionError:  r4: bgpd crashed. Core file found - Backtrace follows: [New LWP 11734] [New LWP 11742] [Thread debugging using libthread_db enabled] Using host libthread_db library "/lib/x86_64-linux-gnu/libthread_db.so.1". Core was generated by `/usr/lib/frr/bgpd'. Program terminated with signal SIGABRT, Aborted. #0  0x00007f0db2771428 in __GI_raise (sig=sig@entry=6) at ../sysdeps/unix/sysv/linux/raise.c:54 [Current thread is 1 (Thread 0x7f0db37b4880 (LWP 11734))] #0  0x00007f0db2771428 in __GI_raise (sig=sig@entry=6) at ../sysdeps/unix/sysv/linux/raise.c:54 #1  0x00007f0db277302a in __GI_abort () at abort.c:89 #2  0x00007f0db34a8250 in ?? () from /usr/lib/x86_64-linux-gnu/frr/libfrr.so.0 #3  <signal handler called> #4  __lll_lock_wait () at ../sysdeps/unix/sysv/linux/x86_64/lowlevellock.S:135 #5  0x00007f0db2b0fdbd in __GI___pthread_mutex_lock (mutex=0x7f0db3716300) at ../nptl/pthread_mutex_lock.c:80 #6  0x00007f0db347acec in frr_pthread_destroy () from /usr/lib/x86_64-linux-gnu/frr/libfrr.so.0 #7  0x00007f0db3486e0a in list_delete_all_node () from /usr/lib/x86_64-linux-gnu/frr/libfrr.so.0 #8  0x00007f0db3486e79 in list_delete () from /usr/lib/x86_64-linux-gnu/frr/libfrr.so.0 #9  0x00007f0db347ae1c in frr_pthread_finish () from /usr/lib/x86_64-linux-gnu/frr/libfrr.so.0 #10 0x00007f0db34866d2 in frr_fini () from /usr/lib/x86_64-linux-gnu/frr/libfrr.so.0 #11 0x000055f81fd01d53 in sigint () #12 0x00007f0db34a82f3 in quagga_sigevent_process () from /usr/lib/x86_64-linux-gnu/frr/libfrr.so.0 #13 0x00007f0db34b5655 in thread_fetch () from /usr/lib/x86_64-linux-gnu/frr/libfrr.so.0 #14 0x00007f0db3486413 in frr_run () from /usr/lib/x86_64-linux-gnu/frr/libfrr.so.0 #15 0x000055f81fcff9e1 in main ()
E   AssertionError: 
    r4: bgpd crashed. Core file found - Backtrace follows:
    [New LWP 11734]
    [New LWP 11742]
    [Thread debugging using libthread_db enabled]
    Using host libthread_db library "/lib/x86_64-linux-gnu/libthread_db.so.1".
    Core was generated by `/usr/lib/frr/bgpd'.
(19 more lines...)
Collapse Failed test_bgp_l3vpn_to_bgp_direct test_memory_leak History
Topology Tests on Ubuntu 18.04 amd64 4 secs
AssertionError:  r4: bgpd crashed. Core file found - Backtrace follows: [New LWP 20240] [New LWP 20247] [Thread debugging using libthread_db enabled] Using host libthread_db library "/lib/x86_64-linux-gnu/libthread_db.so.1". Core was generated by `/usr/lib/frr/bgpd'. Program terminated with signal SIGABRT, Aborted. #0  __GI_raise (sig=sig@entry=6) at ../sysdeps/unix/sysv/linux/raise.c:51 [Current thread is 1 (Thread 0x7fc62aac27c0 (LWP 20240))] #0  __GI_raise (sig=sig@entry=6) at ../sysdeps/unix/sysv/linux/raise.c:51 #1  0x00007fc629946801 in __GI_abort () at abort.c:79 #2  0x00007fc62a7307bf in ?? () from /usr/lib/x86_64-linux-gnu/frr/libfrr.so.0 #3  <signal handler called> #4  __lll_lock_wait () at ../sysdeps/unix/sysv/linux/x86_64/lowlevellock.S:135 #5  0x00007fc629d01023 in __GI___pthread_mutex_lock (mutex=0x7fc62a99e300) at ../nptl/pthread_mutex_lock.c:78 #6  0x00007fc62a7031dc in frr_pthread_destroy () from /usr/lib/x86_64-linux-gnu/frr/libfrr.so.0 #7  0x00007fc62a70f40b in list_delete_all_node () from /usr/lib/x86_64-linux-gnu/frr/libfrr.so.0 #8  0x00007fc62a70f479 in list_delete () from /usr/lib/x86_64-linux-gnu/frr/libfrr.so.0 #9  0x00007fc62a70330c in frr_pthread_finish () from /usr/lib/x86_64-linux-gnu/frr/libfrr.so.0 #10 0x00007fc62a70ecc2 in frr_fini () from /usr/lib/x86_64-linux-gnu/frr/libfrr.so.0 #11 0x0000555c99633cc9 in sigint () #12 0x00007fc62a730853 in quagga_sigevent_process () from /usr/lib/x86_64-linux-gnu/frr/libfrr.so.0 #13 0x00007fc62a73d87d in thread_fetch () from /usr/lib/x86_64-linux-gnu/frr/libfrr.so.0 #14 0x00007fc62a70e9f3 in frr_run () from /usr/lib/x86_64-linux-gnu/frr/libfrr.so.0 #15 0x0000555c99631961 in main ()
E   AssertionError: 
    r4: bgpd crashed. Core file found - Backtrace follows:
    [New LWP 20240]
    [New LWP 20247]
    [Thread debugging using libthread_db enabled]
    Using host libthread_db library "/lib/x86_64-linux-gnu/libthread_db.so.1".
    Core was generated by `/usr/lib/frr/bgpd'.
(19 more lines...)
Collapse Failed test_bgp_l3vpn_to_bgp_direct test_memory_leak History
TopoTest Tests on Ubuntu 16.04 i386 3 secs
AssertionError:  r4: bgpd crashed. Core file found - Backtrace follows: [New LWP 22296] [New LWP 22304] [Thread debugging using libthread_db enabled] Using host libthread_db library "/lib/i386-linux-gnu/libthread_db.so.1". Core was generated by `/usr/lib/frr/bgpd'. Program terminated with signal SIGABRT, Aborted. #0  0xb7ef9d05 in ?? () [Current thread is 1 (Thread 0xb784b7c0 (LWP 22296))] #0  0xb7ef9d05 in ?? () #1  <signal handler called> #2  0xb7ef9d05 in ?? () #3  0xb7e5ded4 in list_delete_all_node () from /usr/lib/i386-linux-gnu/frr/libfrr.so.0 #4  0xb7e5df52 in list_delete () from /usr/lib/i386-linux-gnu/frr/libfrr.so.0 #5  0xb7e515ad in frr_pthread_finish () from /usr/lib/i386-linux-gnu/frr/libfrr.so.0 #6  0xb7e5d778 in frr_fini () from /usr/lib/i386-linux-gnu/frr/libfrr.so.0 #7  0x004538ad in sigint () #8  0xb7e810b1 in quagga_sigevent_process () from /usr/lib/i386-linux-gnu/frr/libfrr.so.0 #9  0xb7e8e698 in thread_fetch () from /usr/lib/i386-linux-gnu/frr/libfrr.so.0 #10 0xb7e5d4ce in frr_run () from /usr/lib/i386-linux-gnu/frr/libfrr.so.0 #11 0x00451491 in main ()
E   AssertionError: 
    r4: bgpd crashed. Core file found - Backtrace follows:
    [New LWP 22296]
    [New LWP 22304]
    [Thread debugging using libthread_db enabled]
    Using host libthread_db library "/lib/i386-linux-gnu/libthread_db.so.1".
    Core was generated by `/usr/lib/frr/bgpd'.
(15 more lines...)
Collapse Failed test_bgp_l3vpn_to_bgp_vrf test_memory_leak History
Topology Tests on Ubuntu 16.04 amd64 4 secs
AssertionError:  r4: bgpd crashed. Core file found - Backtrace follows: [New LWP 13725] [New LWP 13732] [Thread debugging using libthread_db enabled] Using host libthread_db library "/lib/x86_64-linux-gnu/libthread_db.so.1". Core was generated by `/usr/lib/frr/bgpd'. Program terminated with signal SIGABRT, Aborted. #0  0x00007f1158f49428 in __GI_raise (sig=sig@entry=6) at ../sysdeps/unix/sysv/linux/raise.c:54 [Current thread is 1 (Thread 0x7f1159f8c880 (LWP 13725))] #0  0x00007f1158f49428 in __GI_raise (sig=sig@entry=6) at ../sysdeps/unix/sysv/linux/raise.c:54 #1  0x00007f1158f4b02a in __GI_abort () at abort.c:89 #2  0x00007f1159c80250 in ?? () from /usr/lib/x86_64-linux-gnu/frr/libfrr.so.0 #3  <signal handler called> #4  __lll_lock_wait () at ../sysdeps/unix/sysv/linux/x86_64/lowlevellock.S:135 #5  0x00007f11592e7dbd in __GI___pthread_mutex_lock (mutex=0x7f1159eee300) at ../nptl/pthread_mutex_lock.c:80 #6  0x00007f1159c52cec in frr_pthread_destroy () from /usr/lib/x86_64-linux-gnu/frr/libfrr.so.0 #7  0x00007f1159c5ee0a in list_delete_all_node () from /usr/lib/x86_64-linux-gnu/frr/libfrr.so.0 #8  0x00007f1159c5ee79 in list_delete () from /usr/lib/x86_64-linux-gnu/frr/libfrr.so.0 #9  0x00007f1159c52e1c in frr_pthread_finish () from /usr/lib/x86_64-linux-gnu/frr/libfrr.so.0 #10 0x00007f1159c5e6d2 in frr_fini () from /usr/lib/x86_64-linux-gnu/frr/libfrr.so.0 #11 0x0000561e8acd9d53 in sigint () #12 0x00007f1159c802f3 in quagga_sigevent_process () from /usr/lib/x86_64-linux-gnu/frr/libfrr.so.0 #13 0x00007f1159c8d655 in thread_fetch () from /usr/lib/x86_64-linux-gnu/frr/libfrr.so.0 #14 0x00007f1159c5e413 in frr_run () from /usr/lib/x86_64-linux-gnu/frr/libfrr.so.0 #15 0x0000561e8acd79e1 in main ()
E   AssertionError: 
    r4: bgpd crashed. Core file found - Backtrace follows:
    [New LWP 13725]
    [New LWP 13732]
    [Thread debugging using libthread_db enabled]
    Using host libthread_db library "/lib/x86_64-linux-gnu/libthread_db.so.1".
    Core was generated by `/usr/lib/frr/bgpd'.
(19 more lines...)
Collapse Failed test_bgp_l3vpn_to_bgp_vrf test_memory_leak History
Topology Tests on Ubuntu 18.04 amd64 4 secs
AssertionError:  r4: bgpd crashed. Core file found - Backtrace follows: [New LWP 22051] [New LWP 22058] Core was generated by `/usr/lib/frr/bgpd'. Program terminated with signal SIGABRT, Aborted. #0  0x00007fefa8c95e97 in ?? () [Current thread is 1 (LWP 22051)] #0  0x00007fefa8c95e97 in ?? () Backtrace stopped: Cannot access memory at address 0x7ffd0c518fe0
E   AssertionError: 
    r4: bgpd crashed. Core file found - Backtrace follows:
    [New LWP 22051]
    [New LWP 22058]
    Core was generated by `/usr/lib/frr/bgpd'.
    Program terminated with signal SIGABRT, Aborted.
    #0  0x00007fefa8c95e97 in ?? ()
(3 more lines...)
Collapse Failed test_bgp_l3vpn_to_bgp_vrf test_memory_leak History
TopoTest Tests on Ubuntu 16.04 i386 4 secs
AssertionError:  r4: bgpd crashed. Core file found - Backtrace follows: [New LWP 24265] [New LWP 24272] [Thread debugging using libthread_db enabled] Using host libthread_db library "/lib/i386-linux-gnu/libthread_db.so.1". Core was generated by `/usr/lib/frr/bgpd'. Program terminated with signal SIGABRT, Aborted. #0  0xb7f64d05 in ?? () [Current thread is 1 (Thread 0xb78b67c0 (LWP 24265))] #0  0xb7f64d05 in ?? () #1  <signal handler called> #2  0xb7f64d05 in ?? () #3  0xb7ec8ed4 in list_delete_all_node () from /usr/lib/i386-linux-gnu/frr/libfrr.so.0 #4  0xb7ec8f52 in list_delete () from /usr/lib/i386-linux-gnu/frr/libfrr.so.0 #5  0xb7ebc5ad in frr_pthread_finish () from /usr/lib/i386-linux-gnu/frr/libfrr.so.0 #6  0xb7ec8778 in frr_fini () from /usr/lib/i386-linux-gnu/frr/libfrr.so.0 #7  0x005018ad in sigint () #8  0xb7eec0b1 in quagga_sigevent_process () from /usr/lib/i386-linux-gnu/frr/libfrr.so.0 #9  0xb7ef9698 in thread_fetch () from /usr/lib/i386-linux-gnu/frr/libfrr.so.0 #10 0xb7ec84ce in frr_run () from /usr/lib/i386-linux-gnu/frr/libfrr.so.0 #11 0x004ff491 in main ()
E   AssertionError: 
    r4: bgpd crashed. Core file found - Backtrace follows:
    [New LWP 24265]
    [New LWP 24272]
    [Thread debugging using libthread_db enabled]
    Using host libthread_db library "/lib/i386-linux-gnu/libthread_db.so.1".
    Core was generated by `/usr/lib/frr/bgpd'.
(15 more lines...)
Collapse Failed test_bgp_local_as_private_remove test_bgp_remove_private_as History
Topology Tests on Ubuntu 16.04 amd64 21 secs
test teardown failure
E   AssertionError: 
    r4: bgpd crashed. Core file found - Backtrace follows:
    [New LWP 15465]
    [New LWP 15468]
    [Thread debugging using libthread_db enabled]
    Using host libthread_db library "/lib/x86_64-linux-gnu/libthread_db.so.1".
    Core was generated by `/usr/lib/frr/bgpd'.
(97 more lines...)
Collapse Failed test_bgp_local_as_private_remove test_bgp_remove_private_as History
Topology Tests on Ubuntu 18.04 amd64 22 secs
test teardown failure
E   AssertionError: 
    r4: bgpd crashed. Core file found - Backtrace follows:
    [New LWP 24078]
    [New LWP 24081]
    [Thread debugging using libthread_db enabled]
    Using host libthread_db library "/lib/x86_64-linux-gnu/libthread_db.so.1".
    Core was generated by `/usr/lib/frr/bgpd'.
(97 more lines...)
Collapse Failed test_bgp_local_as_private_remove test_bgp_remove_private_as History
TopoTest Tests on Ubuntu 16.04 i386 20 secs
test teardown failure
E   AssertionError: 
    r4: bgpd crashed. Core file found - Backtrace follows:
    [New LWP 25977]
    [New LWP 25980]
    [Thread debugging using libthread_db enabled]
    Using host libthread_db library "/lib/i386-linux-gnu/libthread_db.so.1".
    Core was generated by `/usr/lib/frr/bgpd'.
(81 more lines...)
Collapse Failed test_bgp_maximum_prefix_invalid_update test_bgp_maximum_prefix_invalid History
Topology Tests on Ubuntu 16.04 amd64 20 secs
test teardown failure
E   AssertionError: 
    r1: bgpd crashed. Core file found - Backtrace follows:
    [New LWP 15995]
    [New LWP 15998]
    [Thread debugging using libthread_db enabled]
    Using host libthread_db library "/lib/x86_64-linux-gnu/libthread_db.so.1".
    Core was generated by `/usr/lib/frr/bgpd'.
(45 more lines...)
Collapse Failed test_bgp_maximum_prefix_invalid_update test_bgp_maximum_prefix_invalid History
Topology Tests on Ubuntu 18.04 amd64 21 secs
test teardown failure
E   AssertionError: 
    r1: bgpd crashed. Core file found - Backtrace follows:
    [New LWP 24556]
    [New LWP 24559]
    [Thread debugging using libthread_db enabled]
    Using host libthread_db library "/lib/x86_64-linux-gnu/libthread_db.so.1".
    Core was generated by `/usr/lib/frr/bgpd'.
(45 more lines...)
Collapse Failed test_bgp_maximum_prefix_invalid_update test_bgp_maximum_prefix_invalid History
TopoTest Tests on Ubuntu 16.04 i386 20 secs
test teardown failure
E   AssertionError: 
    r1: bgpd crashed. Core file found - Backtrace follows:
    [New LWP 26503]
    [New LWP 26506]
    [Thread debugging using libthread_db enabled]
    Using host libthread_db library "/lib/i386-linux-gnu/libthread_db.so.1".
    Core was generated by `/usr/lib/frr/bgpd'.
(37 more lines...)
Collapse Failed test_bgp_multiview_topo1 test_shutdown_check_stderr History
Topology Tests on Ubuntu 16.04 amd64 2 secs
AssertionError:  r1: bgpd crashed. Core file found - Backtrace follows: [New LWP 16649] [New LWP 16651] [Thread debugging using libthread_db enabled] Using host libthread_db library "/lib/x86_64-linux-gnu/libthread_db.so.1". Core was generated by `/usr/lib/frr/bgpd'. Program terminated with signal SIGABRT, Aborted. #0  0x00007f72335f1428 in __GI_raise (sig=sig@entry=6) at ../sysdeps/unix/sysv/linux/raise.c:54 [Current thread is 1 (Thread 0x7f7234634880 (LWP 16649))] #0  0x00007f72335f1428 in __GI_raise (sig=sig@entry=6) at ../sysdeps/unix/sysv/linux/raise.c:54 #1  0x00007f72335f302a in __GI_abort () at abort.c:89 #2  0x00007f7234328250 in ?? () from /usr/lib/x86_64-linux-gnu/frr/libfrr.so.0 #3  <signal handler called> #4  __lll_lock_wait () at ../sysdeps/unix/sysv/linux/x86_64/lowlevellock.S:135 #5  0x00007f723398fdbd in __GI___pthread_mutex_lock (mutex=0x7f7234596300) at ../nptl/pthread_mutex_lock.c:80 #6  0x00007f72342facec in frr_pthread_destroy () from /usr/lib/x86_64-linux-gnu/frr/libfrr.so.0 #7  0x00007f7234306e0a in list_delete_all_node () from /usr/lib/x86_64-linux-gnu/frr/libfrr.so.0 #8  0x00007f7234306e79 in list_delete () from /usr/lib/x86_64-linux-gnu/frr/libfrr.so.0 #9  0x00007f72342fae1c in frr_pthread_finish () from /usr/lib/x86_64-linux-gnu/frr/libfrr.so.0 #10 0x00007f72343066d2 in frr_fini () from /usr/lib/x86_64-linux-gnu/frr/libfrr.so.0 #11 0x000055be36689d53 in sigint () #12 0x00007f72343282f3 in quagga_sigevent_process () from /usr/lib/x86_64-linux-gnu/frr/libfrr.so.0 #13 0x00007f7234335655 in thread_fetch () from /usr/lib/x86_64-linux-gnu/frr/libfrr.so.0 #14 0x00007f7234306413 in frr_run () from /usr/lib/x86_64-linux-gnu/frr/libfrr.so.0 #15 0x000055be366879e1 in main ()
E   AssertionError: 
    r1: bgpd crashed. Core file found - Backtrace follows:
    [New LWP 16649]
    [New LWP 16651]
    [Thread debugging using libthread_db enabled]
    Using host libthread_db library "/lib/x86_64-linux-gnu/libthread_db.so.1".
    Core was generated by `/usr/lib/frr/bgpd'.
(19 more lines...)
Collapse Failed test_bgp_multiview_topo1 test_shutdown_check_stderr History
Topology Tests on Ubuntu 18.04 amd64 2 secs
AssertionError:  r1: bgpd crashed. Core file found - Backtrace follows: [New LWP 25034] [New LWP 25036] [Thread debugging using libthread_db enabled] Using host libthread_db library "/lib/x86_64-linux-gnu/libthread_db.so.1". Core was generated by `/usr/lib/frr/bgpd'. Program terminated with signal SIGABRT, Aborted. #0  __GI_raise (sig=sig@entry=6) at ../sysdeps/unix/sysv/linux/raise.c:51 [Current thread is 1 (Thread 0x7f19537cb7c0 (LWP 25034))] #0  __GI_raise (sig=sig@entry=6) at ../sysdeps/unix/sysv/linux/raise.c:51 #1  0x00007f195264f801 in __GI_abort () at abort.c:79 #2  0x00007f19534397bf in ?? () from /usr/lib/x86_64-linux-gnu/frr/libfrr.so.0 #3  <signal handler called> #4  __lll_lock_wait () at ../sysdeps/unix/sysv/linux/x86_64/lowlevellock.S:135 #5  0x00007f1952a0a023 in __GI___pthread_mutex_lock (mutex=0x7f19536a7300) at ../nptl/pthread_mutex_lock.c:78 #6  0x00007f195340c1dc in frr_pthread_destroy () from /usr/lib/x86_64-linux-gnu/frr/libfrr.so.0 #7  0x00007f195341840b in list_delete_all_node () from /usr/lib/x86_64-linux-gnu/frr/libfrr.so.0 #8  0x00007f1953418479 in list_delete () from /usr/lib/x86_64-linux-gnu/frr/libfrr.so.0 #9  0x00007f195340c30c in frr_pthread_finish () from /usr/lib/x86_64-linux-gnu/frr/libfrr.so.0 #10 0x00007f1953417cc2 in frr_fini () from /usr/lib/x86_64-linux-gnu/frr/libfrr.so.0 #11 0x0000564b9be81cc9 in sigint () #12 0x00007f1953439853 in quagga_sigevent_process () from /usr/lib/x86_64-linux-gnu/frr/libfrr.so.0 #13 0x00007f195344687d in thread_fetch () from /usr/lib/x86_64-linux-gnu/frr/libfrr.so.0 #14 0x00007f19534179f3 in frr_run () from /usr/lib/x86_64-linux-gnu/frr/libfrr.so.0 #15 0x0000564b9be7f961 in main ()
E   AssertionError: 
    r1: bgpd crashed. Core file found - Backtrace follows:
    [New LWP 25034]
    [New LWP 25036]
    [Thread debugging using libthread_db enabled]
    Using host libthread_db library "/lib/x86_64-linux-gnu/libthread_db.so.1".
    Core was generated by `/usr/lib/frr/bgpd'.
(19 more lines...)
Collapse Failed test_bgp_multiview_topo1 test_shutdown_check_stderr History
TopoTest Tests on Ubuntu 16.04 i386 2 secs
AssertionError:  r1: bgpd crashed. Core file found - Backtrace follows: [New LWP 27144] [New LWP 27146] [Thread debugging using libthread_db enabled] Using host libthread_db library "/lib/i386-linux-gnu/libthread_db.so.1". Core was generated by `/usr/lib/frr/bgpd'. Program terminated with signal SIGABRT, Aborted. #0  0xb7f77d05 in ?? () [Current thread is 1 (Thread 0xb78c97c0 (LWP 27144))] #0  0xb7f77d05 in ?? () #1  <signal handler called> #2  0xb7f77d05 in ?? () #3  0xb7edbed4 in list_delete_all_node () from /usr/lib/i386-linux-gnu/frr/libfrr.so.0 #4  0xb7edbf52 in list_delete () from /usr/lib/i386-linux-gnu/frr/libfrr.so.0 #5  0xb7ecf5ad in frr_pthread_finish () from /usr/lib/i386-linux-gnu/frr/libfrr.so.0 #6  0xb7edb778 in frr_fini () from /usr/lib/i386-linux-gnu/frr/libfrr.so.0 #7  0x0046f8ad in sigint () #8  0xb7eff0b1 in quagga_sigevent_process () from /usr/lib/i386-linux-gnu/frr/libfrr.so.0 #9  0xb7f0c698 in thread_fetch () from /usr/lib/i386-linux-gnu/frr/libfrr.so.0 #10 0xb7edb4ce in frr_run () from /usr/lib/i386-linux-gnu/frr/libfrr.so.0 #11 0x0046d491 in main ()
E   AssertionError: 
    r1: bgpd crashed. Core file found - Backtrace follows:
    [New LWP 27144]
    [New LWP 27146]
    [Thread debugging using libthread_db enabled]
    Using host libthread_db library "/lib/i386-linux-gnu/libthread_db.so.1".
    Core was generated by `/usr/lib/frr/bgpd'.
(15 more lines...)
Collapse Failed test_bgp_path_attributes test_admin_distance History
Topology Tests on Ubuntu 16.04 amd64 25 secs
test teardown failure
E   AssertionError: 
    r4: bgpd crashed. Core file found - Backtrace follows:
    [New LWP 3917]
    [New LWP 3920]
    [Thread debugging using libthread_db enabled]
    Using host libthread_db library "/lib/x86_64-linux-gnu/libthread_db.so.1".
    Core was generated by `/usr/lib/frr/bgpd'.
(175 more lines...)
Collapse Failed test_bgp_path_attributes test_admin_distance History
Topology Tests on Ubuntu 18.04 amd64 27 secs
test teardown failure
E   AssertionError: 
    r4: bgpd crashed. Core file found - Backtrace follows:
    [New LWP 12940]
    [New LWP 12943]
    [Thread debugging using libthread_db enabled]
    Using host libthread_db library "/lib/x86_64-linux-gnu/libthread_db.so.1".
    Core was generated by `/usr/lib/frr/bgpd'.
(175 more lines...)