FreeRangeRouting Github Pull Request Testing

Build: #8603 failed Custom build by Github Hook with revision master

Build result summary

Details

Completed
Duration
89 minutes
Flags
Custom revisionCustom build
Labels
version=frr-7_1-dev-2303-gea7ec2616git=https_//github_com/frrouting/frr_gitbuildurl=https_//ci1_netdef_org/browse/frr-frrpullreq-8603branch=master
Revision
ce935bc2843cb35c5450e1ea9beb1c58474d6e2c ce935bc2843cb35c5450e1ea9beb1c58474d6e2c
Total tests
6936
Failing since
#8602 (Custom build by Github Hook with revision master)
Fixed in
#8604 (Custom build by Github Hook with revision master)

Tests

Custom variables

Custom revision
ce935bc2843cb35c5450e1ea9beb1c58474d6e2c ce935bc2843cb35c5450e1ea9beb1c58474d6e2c
Name Value
github_base_sha ce935bc2843cb35c5450e1ea9beb1c58474d6e2c
github_pullreq 4832
github_repo FRRouting/frr
github_merge_sha ea7ec26162b248600626b81f8eddb74e6d059e36
github_branch master

Comments

  1. Github Hook

    GitHub Merge Request 4832
    for GitHub Repo FRRouting/frr, branch master

    Request to merge from ddutt/frr
    Merge Git Commit ID ea7ec26162b248600626b81f8eddb74e6d059e36 on top of base Git Commit ID ce935bc2843cb35c5450e1ea9beb1c58474d6e2c

Code commits

Author Commit Message Commit date
Sri Mohana Singamsetty <srimohans@gmail.com> Sri Mohana Singamsetty <srimohans@gmail.com> ce935bc2843cb35c5450e1ea9beb1c58474d6e2c ce935bc2843cb35c5450e1ea9beb1c58474d6e2c Merge pull request #4706 from qlyoung/fix-exit-vrf-markfile
vtysh: mark exit-vrf with end when using vtysh -m

Tests

New test failures 2
Status Test View job Duration
Collapse Failed test_bgp_path_attributes test_localpref_attribute History
Topology Tests on Ubuntu 16.04 amd64 11 secs
AssertionError: Testcase test_localpref_attribute : Failed     Error: Incorrect Nexthop for BGP route 200.60.2.0/32 in RIB of router r1, Expected: 10.0.0.6, Found: 10.0.0.2    assert 'Incorrect Nexthop for BGP route 200.60.2.0/32 in RIB of router r1, Expected: 10.0.0.6, Found: 10.0.0.2\n' is True
E   AssertionError: Testcase test_localpref_attribute : Failed 
       Error: Incorrect Nexthop for BGP route 200.60.2.0/32 in RIB of router r1, Expected: 10.0.0.6, Found: 10.0.0.2
      
    assert 'Incorrect Nexthop for BGP route 200.60.2.0/32 in RIB of router r1, Expected: 10.0.0.6, Found: 10.0.0.2\n' is True
Collapse Failed test_bgp_rfapi_basic_sanity test_adjacencies History
TopoTest Tests on Ubuntu 16.04 i386 47 secs
AssertionError: 1 tests failed
E   AssertionError: 1 tests failed