FreeRangeRouting Github Pull Request Testing

Build: #8861 failed Custom build by Github Hook with revision master

Build result summary

Details

Completed
Duration
127 minutes
Flags
Custom revisionCustom build
Labels
version=frr-7_1-dev-2538-g2df79002cgit=https_//github_com/frrouting/frr_gitbuildurl=https_//ci1_netdef_org/browse/frr-frrpullreq-8861branch=master
Revision
e25352de4a340c42ab4b26959e5d63f24a7358c9 e25352de4a340c42ab4b26959e5d63f24a7358c9
Total tests
7032
Fixed in
#8863 (Custom build by Github Hook with revision master)

Tests

Custom variables

Custom revision
e25352de4a340c42ab4b26959e5d63f24a7358c9 e25352de4a340c42ab4b26959e5d63f24a7358c9
Name Value
github_base_sha e25352de4a340c42ab4b26959e5d63f24a7358c9
github_pullreq 4964
github_repo FRRouting/frr
github_merge_sha 2df79002ce778b8e61438429e9b3ec96f323eaf0
github_branch master

Comments

  1. Github Hook

    GitHub Merge Request 4964
    for GitHub Repo FRRouting/frr, branch master

    Request to merge from ashish12pant/frr
    Merge Git Commit ID 2df79002ce778b8e61438429e9b3ec96f323eaf0 on top of base Git Commit ID e25352de4a340c42ab4b26959e5d63f24a7358c9

Code commits

Author Commit Message Commit date
Renato Westphal Renato Westphal e25352de4a340c42ab4b26959e5d63f24a7358c9 e25352de4a340c42ab4b26959e5d63f24a7358c9 Merge pull request #4950 from donaldsharp/table_summary
Table summary

Tests

New test failures 23
Status Test View job Duration
Collapse Failed test_bgp_basic_functionality test_bgp_with_loopback_interface History
TopoTest Tests on Ubuntu 16.04 i386 54 secs
AssertionError: Testcase test_bgp_with_loopback_interface :Failed     Error: BGP is not converged for router r1 assert 'BGP is not converged for router r1' is True
E   AssertionError: Testcase test_bgp_with_loopback_interface :Failed 
       Error: BGP is not converged for router r1
    assert 'BGP is not converged for router r1' is True
Collapse Failed test_ebgp_ecmp_topo2 test_modify_ecmp_max_paths[advertise_nw-16] History
Topology Tests on Ubuntu 18.04 amd64 27 secs
AssertionError: Testcase test_modify_ecmp_max_paths[advertise_nw-16] : Failed     Error: !! Failed: Missing Next hops [u'fe80::8d:34ff:fe69:123a', u'fe80::808:7bff:fe91:4991', u'fe80::c94:45ff:fe5f:85d9', u'fe80::2466:e8ff:fe83:c2fb', u'fe80::2864:4cff:fecb:64a6', u'fe80::2897:fff:fe89:4bce', u'fe80::28ef:84ff:fe03:31b9', u'fe80::2c49:cbff:febb:da8b', u'fe80::3c22:dcff:fe14:e5ef', u'fe80::40cd:bff:fec4:4d10', u'fe80::48f6:b5ff:fe00:e1a9', u'fe80::58fd:e7ff:fe87:2c5a', u'fe80::6818:1aff:fe7b:a6f8', u'fe80::7046:dcff:fe9f:932', u'fe80::745b:5cff:fecd:b69', u'fe80::7462:10ff:fe02:2bf8'], in RIB of router r3 for [bgp] route 1::/64    assert "!! Failed: Missing Next hops [u'fe80::8d:34ff:fe69:123a', u'fe80::808:7bff:fe91:4991', u'fe80::c94:45ff:fe5f:85d9', u...ff:fe9f:932', u'fe80::745b:5cff:fecd:b69', u'fe80::7462:10ff:fe02:2bf8'], in RIB of router r3 for [bgp] route 1::/64\n" is True
E   AssertionError: Testcase test_modify_ecmp_max_paths[advertise_nw-16] : Failed 
       Error: !! Failed: Missing Next hops [u'fe80::8d:34ff:fe69:123a', u'fe80::808:7bff:fe91:4991', u'fe80::c94:45ff:fe5f:85d9', u'fe80::2466:e8ff:fe83:c2fb', u'fe80::2864:4cff:fecb:64a6', u'fe80::2897:fff:fe89:4bce', u'fe80::28ef:84ff:fe03:31b9', u'fe80::2c49:cbff:febb:da8b', u'fe80::3c22:dcff:fe14:e5ef', u'fe80::40cd:bff:fec4:4d10', u'fe80::48f6:b5ff:fe00:e1a9', u'fe80::58fd:e7ff:fe87:2c5a', u'fe80::6818:1aff:fe7b:a6f8', u'fe80::7046:dcff:fe9f:932', u'fe80::745b:5cff:fecd:b69', u'fe80::7462:10ff:fe02:2bf8'], in RIB of router r3 for [bgp] route 1::/64
      
    assert "!! Failed: Missing Next hops [u'fe80::8d:34ff:fe69:123a', u'fe80::808:7bff:fe91:4991', u'fe80::c94:45ff:fe5f:85d9', u...ff:fe9f:932', u'fe80::745b:5cff:fecd:b69', u'fe80::7462:10ff:fe02:2bf8'], in RIB of router r3 for [bgp] route 1::/64\n" is True
Collapse Failed test_ebgp_ecmp_topo2 test_ecmp_shut_bgp_neighbor History
Topology Tests on Ubuntu 18.04 amd64 27 secs
AssertionError: Testcase test_ecmp_shut_bgp_neighbor : Failed     Error: !! Failed: Missing Next hops [u'fe80::8d:34ff:fe69:123a', u'fe80::808:7bff:fe91:4991', u'fe80::c94:45ff:fe5f:85d9', u'fe80::2466:e8ff:fe83:c2fb', u'fe80::2864:4cff:fecb:64a6', u'fe80::2897:fff:fe89:4bce', u'fe80::28ef:84ff:fe03:31b9', u'fe80::2c49:cbff:febb:da8b', u'fe80::3c22:dcff:fe14:e5ef', u'fe80::40cd:bff:fec4:4d10', u'fe80::48f6:b5ff:fe00:e1a9', u'fe80::58fd:e7ff:fe87:2c5a', u'fe80::6818:1aff:fe7b:a6f8', u'fe80::7046:dcff:fe9f:932', u'fe80::745b:5cff:fecd:b69', u'fe80::7462:10ff:fe02:2bf8', u'fe80::8044:26ff:fe38:dbef', u'fe80::80d8:1dff:fea2:4df3', u'fe80::8ccf:11ff:fe7a:7983', u'fe80::8ce2:cdff:fe8e:d2dc', u'fe80::a06f:92ff:fe5c:630b', u'fe80::a09f:70ff:fe26:50d9', u'fe80::a0d4:8bff:fe39:1ac3', u'fe80::ac3c:60ff:fe1d:1881', u'fe80::bc25:24ff:fec7:3467', u'fe80::c0cb:19ff:fed2:eddb', u'fe80::d479:d2ff:fe81:fd4d', u'fe80::dc03:e4ff:fe17:366', u'fe80::e0b6:3fff:fee7:3b02', u'fe80::e0e2:b8ff:fee0:1534', u'fe80::f016:f1ff:fef8:e2dc', u'fe80::f44d:30ff:fe59:c9c5'], in RIB of router r3 for [bgp] route 1::/64    assert "!! Failed: Missing Next hops [u'fe80::8d:34ff:fe69:123a', u'fe80::808:7bff:fe91:4991', u'fe80::c94:45ff:fe5f:85d9', u...:fee0:1534', u'fe80::f016:f1ff:fef8:e2dc', u'fe80::f44d:30ff:fe59:c9c5'], in RIB of router r3 for [bgp] route 1::/64\n" is True
E   AssertionError: Testcase test_ecmp_shut_bgp_neighbor : Failed 
       Error: !! Failed: Missing Next hops [u'fe80::8d:34ff:fe69:123a', u'fe80::808:7bff:fe91:4991', u'fe80::c94:45ff:fe5f:85d9', u'fe80::2466:e8ff:fe83:c2fb', u'fe80::2864:4cff:fecb:64a6', u'fe80::2897:fff:fe89:4bce', u'fe80::28ef:84ff:fe03:31b9', u'fe80::2c49:cbff:febb:da8b', u'fe80::3c22:dcff:fe14:e5ef', u'fe80::40cd:bff:fec4:4d10', u'fe80::48f6:b5ff:fe00:e1a9', u'fe80::58fd:e7ff:fe87:2c5a', u'fe80::6818:1aff:fe7b:a6f8', u'fe80::7046:dcff:fe9f:932', u'fe80::745b:5cff:fecd:b69', u'fe80::7462:10ff:fe02:2bf8', u'fe80::8044:26ff:fe38:dbef', u'fe80::80d8:1dff:fea2:4df3', u'fe80::8ccf:11ff:fe7a:7983', u'fe80::8ce2:cdff:fe8e:d2dc', u'fe80::a06f:92ff:fe5c:630b', u'fe80::a09f:70ff:fe26:50d9', u'fe80::a0d4:8bff:fe39:1ac3', u'fe80::ac3c:60ff:fe1d:1881', u'fe80::bc25:24ff:fec7:3467', u'fe80::c0cb:19ff:fed2:eddb', u'fe80::d479:d2ff:fe81:fd4d', u'fe80::dc03:e4ff:fe17:366', u'fe80::e0b6:3fff:fee7:3b02', u'fe80::e0e2:b8ff:fee0:1534', u'fe80::f016:f1ff:fef8:e2dc', u'fe80::f44d:30ff:fe59:c9c5'], in RIB of router r3 for [bgp] route 1::/64
      
    assert "!! Failed: Missing Next hops [u'fe80::8d:34ff:fe69:123a', u'fe80::808:7bff:fe91:4991', u'fe80::c94:45ff:fe5f:85d9', u...:fee0:1534', u'fe80::f016:f1ff:fef8:e2dc', u'fe80::f44d:30ff:fe59:c9c5'], in RIB of router r3 for [bgp] route 1::/64\n" is True
Collapse Failed test_ebgp_ecmp_topo2 test_ecmp_after_clear_bgp History
Topology Tests on Ubuntu 18.04 amd64 27 secs
AssertionError: Testcase test_ecmp_after_clear_bgp : Failed     Error: !! Failed: Missing Next hops [u'fe80::8d:34ff:fe69:123a', u'fe80::808:7bff:fe91:4991', u'fe80::c94:45ff:fe5f:85d9', u'fe80::2466:e8ff:fe83:c2fb', u'fe80::2864:4cff:fecb:64a6', u'fe80::2897:fff:fe89:4bce', u'fe80::28ef:84ff:fe03:31b9', u'fe80::2c49:cbff:febb:da8b', u'fe80::3c22:dcff:fe14:e5ef', u'fe80::40cd:bff:fec4:4d10', u'fe80::48f6:b5ff:fe00:e1a9', u'fe80::58fd:e7ff:fe87:2c5a', u'fe80::6818:1aff:fe7b:a6f8', u'fe80::7046:dcff:fe9f:932', u'fe80::745b:5cff:fecd:b69', u'fe80::7462:10ff:fe02:2bf8', u'fe80::8044:26ff:fe38:dbef', u'fe80::80d8:1dff:fea2:4df3', u'fe80::8ccf:11ff:fe7a:7983', u'fe80::8ce2:cdff:fe8e:d2dc', u'fe80::a06f:92ff:fe5c:630b', u'fe80::a09f:70ff:fe26:50d9', u'fe80::a0d4:8bff:fe39:1ac3', u'fe80::ac3c:60ff:fe1d:1881', u'fe80::bc25:24ff:fec7:3467', u'fe80::c0cb:19ff:fed2:eddb', u'fe80::d479:d2ff:fe81:fd4d', u'fe80::dc03:e4ff:fe17:366', u'fe80::e0b6:3fff:fee7:3b02', u'fe80::e0e2:b8ff:fee0:1534', u'fe80::f016:f1ff:fef8:e2dc', u'fe80::f44d:30ff:fe59:c9c5'], in RIB of router r3 for [bgp] route 1::/64    assert "!! Failed: Missing Next hops [u'fe80::8d:34ff:fe69:123a', u'fe80::808:7bff:fe91:4991', u'fe80::c94:45ff:fe5f:85d9', u...:fee0:1534', u'fe80::f016:f1ff:fef8:e2dc', u'fe80::f44d:30ff:fe59:c9c5'], in RIB of router r3 for [bgp] route 1::/64\n" is True
E   AssertionError: Testcase test_ecmp_after_clear_bgp : Failed 
       Error: !! Failed: Missing Next hops [u'fe80::8d:34ff:fe69:123a', u'fe80::808:7bff:fe91:4991', u'fe80::c94:45ff:fe5f:85d9', u'fe80::2466:e8ff:fe83:c2fb', u'fe80::2864:4cff:fecb:64a6', u'fe80::2897:fff:fe89:4bce', u'fe80::28ef:84ff:fe03:31b9', u'fe80::2c49:cbff:febb:da8b', u'fe80::3c22:dcff:fe14:e5ef', u'fe80::40cd:bff:fec4:4d10', u'fe80::48f6:b5ff:fe00:e1a9', u'fe80::58fd:e7ff:fe87:2c5a', u'fe80::6818:1aff:fe7b:a6f8', u'fe80::7046:dcff:fe9f:932', u'fe80::745b:5cff:fecd:b69', u'fe80::7462:10ff:fe02:2bf8', u'fe80::8044:26ff:fe38:dbef', u'fe80::80d8:1dff:fea2:4df3', u'fe80::8ccf:11ff:fe7a:7983', u'fe80::8ce2:cdff:fe8e:d2dc', u'fe80::a06f:92ff:fe5c:630b', u'fe80::a09f:70ff:fe26:50d9', u'fe80::a0d4:8bff:fe39:1ac3', u'fe80::ac3c:60ff:fe1d:1881', u'fe80::bc25:24ff:fec7:3467', u'fe80::c0cb:19ff:fed2:eddb', u'fe80::d479:d2ff:fe81:fd4d', u'fe80::dc03:e4ff:fe17:366', u'fe80::e0b6:3fff:fee7:3b02', u'fe80::e0e2:b8ff:fee0:1534', u'fe80::f016:f1ff:fef8:e2dc', u'fe80::f44d:30ff:fe59:c9c5'], in RIB of router r3 for [bgp] route 1::/64
      
    assert "!! Failed: Missing Next hops [u'fe80::8d:34ff:fe69:123a', u'fe80::808:7bff:fe91:4991', u'fe80::c94:45ff:fe5f:85d9', u...:fee0:1534', u'fe80::f016:f1ff:fef8:e2dc', u'fe80::f44d:30ff:fe59:c9c5'], in RIB of router r3 for [bgp] route 1::/64\n" is True
Collapse Failed test_ebgp_ecmp_topo2 test_modify_ecmp_max_paths[redist_static-32] History
Topology Tests on Ubuntu 18.04 amd64 27 secs
AssertionError: Testcase test_modify_ecmp_max_paths[redist_static-32] : Failed     Error: !! Failed: Missing Next hops [u'fe80::8d:34ff:fe69:123a', u'fe80::808:7bff:fe91:4991', u'fe80::c94:45ff:fe5f:85d9', u'fe80::2466:e8ff:fe83:c2fb', u'fe80::2864:4cff:fecb:64a6', u'fe80::2897:fff:fe89:4bce', u'fe80::28ef:84ff:fe03:31b9', u'fe80::2c49:cbff:febb:da8b', u'fe80::3c22:dcff:fe14:e5ef', u'fe80::40cd:bff:fec4:4d10', u'fe80::48f6:b5ff:fe00:e1a9', u'fe80::58fd:e7ff:fe87:2c5a', u'fe80::6818:1aff:fe7b:a6f8', u'fe80::7046:dcff:fe9f:932', u'fe80::745b:5cff:fecd:b69', u'fe80::7462:10ff:fe02:2bf8', u'fe80::8044:26ff:fe38:dbef', u'fe80::80d8:1dff:fea2:4df3', u'fe80::8ccf:11ff:fe7a:7983', u'fe80::8ce2:cdff:fe8e:d2dc', u'fe80::a06f:92ff:fe5c:630b', u'fe80::a09f:70ff:fe26:50d9', u'fe80::a0d4:8bff:fe39:1ac3', u'fe80::ac3c:60ff:fe1d:1881', u'fe80::bc25:24ff:fec7:3467', u'fe80::c0cb:19ff:fed2:eddb', u'fe80::d479:d2ff:fe81:fd4d', u'fe80::dc03:e4ff:fe17:366', u'fe80::e0b6:3fff:fee7:3b02', u'fe80::e0e2:b8ff:fee0:1534', u'fe80::f016:f1ff:fef8:e2dc', u'fe80::f44d:30ff:fe59:c9c5'], in RIB of router r3 for [bgp] route 1::/64    assert "!! Failed: Missing Next hops [u'fe80::8d:34ff:fe69:123a', u'fe80::808:7bff:fe91:4991', u'fe80::c94:45ff:fe5f:85d9', u...:fee0:1534', u'fe80::f016:f1ff:fef8:e2dc', u'fe80::f44d:30ff:fe59:c9c5'], in RIB of router r3 for [bgp] route 1::/64\n" is True
E   AssertionError: Testcase test_modify_ecmp_max_paths[redist_static-32] : Failed 
       Error: !! Failed: Missing Next hops [u'fe80::8d:34ff:fe69:123a', u'fe80::808:7bff:fe91:4991', u'fe80::c94:45ff:fe5f:85d9', u'fe80::2466:e8ff:fe83:c2fb', u'fe80::2864:4cff:fecb:64a6', u'fe80::2897:fff:fe89:4bce', u'fe80::28ef:84ff:fe03:31b9', u'fe80::2c49:cbff:febb:da8b', u'fe80::3c22:dcff:fe14:e5ef', u'fe80::40cd:bff:fec4:4d10', u'fe80::48f6:b5ff:fe00:e1a9', u'fe80::58fd:e7ff:fe87:2c5a', u'fe80::6818:1aff:fe7b:a6f8', u'fe80::7046:dcff:fe9f:932', u'fe80::745b:5cff:fecd:b69', u'fe80::7462:10ff:fe02:2bf8', u'fe80::8044:26ff:fe38:dbef', u'fe80::80d8:1dff:fea2:4df3', u'fe80::8ccf:11ff:fe7a:7983', u'fe80::8ce2:cdff:fe8e:d2dc', u'fe80::a06f:92ff:fe5c:630b', u'fe80::a09f:70ff:fe26:50d9', u'fe80::a0d4:8bff:fe39:1ac3', u'fe80::ac3c:60ff:fe1d:1881', u'fe80::bc25:24ff:fec7:3467', u'fe80::c0cb:19ff:fed2:eddb', u'fe80::d479:d2ff:fe81:fd4d', u'fe80::dc03:e4ff:fe17:366', u'fe80::e0b6:3fff:fee7:3b02', u'fe80::e0e2:b8ff:fee0:1534', u'fe80::f016:f1ff:fef8:e2dc', u'fe80::f44d:30ff:fe59:c9c5'], in RIB of router r3 for [bgp] route 1::/64
      
    assert "!! Failed: Missing Next hops [u'fe80::8d:34ff:fe69:123a', u'fe80::808:7bff:fe91:4991', u'fe80::c94:45ff:fe5f:85d9', u...:fee0:1534', u'fe80::f016:f1ff:fef8:e2dc', u'fe80::f44d:30ff:fe59:c9c5'], in RIB of router r3 for [bgp] route 1::/64\n" is True
Collapse Failed test_ebgp_ecmp_topo2 test_ecmp_remove_static_route History
Topology Tests on Ubuntu 18.04 amd64 27 secs
AssertionError: Testcase test_ecmp_remove_static_route : Failed     Error: !! Failed: Missing Next hops [u'fe80::8d:34ff:fe69:123a', u'fe80::808:7bff:fe91:4991', u'fe80::c94:45ff:fe5f:85d9', u'fe80::2466:e8ff:fe83:c2fb', u'fe80::2864:4cff:fecb:64a6', u'fe80::2897:fff:fe89:4bce', u'fe80::28ef:84ff:fe03:31b9', u'fe80::2c49:cbff:febb:da8b', u'fe80::3c22:dcff:fe14:e5ef', u'fe80::40cd:bff:fec4:4d10', u'fe80::48f6:b5ff:fe00:e1a9', u'fe80::58fd:e7ff:fe87:2c5a', u'fe80::6818:1aff:fe7b:a6f8', u'fe80::7046:dcff:fe9f:932', u'fe80::745b:5cff:fecd:b69', u'fe80::7462:10ff:fe02:2bf8', u'fe80::8044:26ff:fe38:dbef', u'fe80::80d8:1dff:fea2:4df3', u'fe80::8ccf:11ff:fe7a:7983', u'fe80::8ce2:cdff:fe8e:d2dc', u'fe80::a06f:92ff:fe5c:630b', u'fe80::a09f:70ff:fe26:50d9', u'fe80::a0d4:8bff:fe39:1ac3', u'fe80::ac3c:60ff:fe1d:1881', u'fe80::bc25:24ff:fec7:3467', u'fe80::c0cb:19ff:fed2:eddb', u'fe80::d479:d2ff:fe81:fd4d', u'fe80::dc03:e4ff:fe17:366', u'fe80::e0b6:3fff:fee7:3b02', u'fe80::e0e2:b8ff:fee0:1534', u'fe80::f016:f1ff:fef8:e2dc', u'fe80::f44d:30ff:fe59:c9c5'], in RIB of router r3 for [bgp] route 1::/64    assert "!! Failed: Missing Next hops [u'fe80::8d:34ff:fe69:123a', u'fe80::808:7bff:fe91:4991', u'fe80::c94:45ff:fe5f:85d9', u...:fee0:1534', u'fe80::f016:f1ff:fef8:e2dc', u'fe80::f44d:30ff:fe59:c9c5'], in RIB of router r3 for [bgp] route 1::/64\n" is True
E   AssertionError: Testcase test_ecmp_remove_static_route : Failed 
       Error: !! Failed: Missing Next hops [u'fe80::8d:34ff:fe69:123a', u'fe80::808:7bff:fe91:4991', u'fe80::c94:45ff:fe5f:85d9', u'fe80::2466:e8ff:fe83:c2fb', u'fe80::2864:4cff:fecb:64a6', u'fe80::2897:fff:fe89:4bce', u'fe80::28ef:84ff:fe03:31b9', u'fe80::2c49:cbff:febb:da8b', u'fe80::3c22:dcff:fe14:e5ef', u'fe80::40cd:bff:fec4:4d10', u'fe80::48f6:b5ff:fe00:e1a9', u'fe80::58fd:e7ff:fe87:2c5a', u'fe80::6818:1aff:fe7b:a6f8', u'fe80::7046:dcff:fe9f:932', u'fe80::745b:5cff:fecd:b69', u'fe80::7462:10ff:fe02:2bf8', u'fe80::8044:26ff:fe38:dbef', u'fe80::80d8:1dff:fea2:4df3', u'fe80::8ccf:11ff:fe7a:7983', u'fe80::8ce2:cdff:fe8e:d2dc', u'fe80::a06f:92ff:fe5c:630b', u'fe80::a09f:70ff:fe26:50d9', u'fe80::a0d4:8bff:fe39:1ac3', u'fe80::ac3c:60ff:fe1d:1881', u'fe80::bc25:24ff:fec7:3467', u'fe80::c0cb:19ff:fed2:eddb', u'fe80::d479:d2ff:fe81:fd4d', u'fe80::dc03:e4ff:fe17:366', u'fe80::e0b6:3fff:fee7:3b02', u'fe80::e0e2:b8ff:fee0:1534', u'fe80::f016:f1ff:fef8:e2dc', u'fe80::f44d:30ff:fe59:c9c5'], in RIB of router r3 for [bgp] route 1::/64
      
    assert "!! Failed: Missing Next hops [u'fe80::8d:34ff:fe69:123a', u'fe80::808:7bff:fe91:4991', u'fe80::c94:45ff:fe5f:85d9', u...:fee0:1534', u'fe80::f016:f1ff:fef8:e2dc', u'fe80::f44d:30ff:fe59:c9c5'], in RIB of router r3 for [bgp] route 1::/64\n" is True
Collapse Failed test_ebgp_ecmp_topo2 test_ecmp_remove_redistribute_static History
Topology Tests on Ubuntu 18.04 amd64 27 secs
AssertionError: Testcase test_ecmp_remove_redistribute_static : Failed     Error: !! Failed: Missing Next hops [u'fe80::8d:34ff:fe69:123a', u'fe80::808:7bff:fe91:4991', u'fe80::c94:45ff:fe5f:85d9', u'fe80::2466:e8ff:fe83:c2fb', u'fe80::2864:4cff:fecb:64a6', u'fe80::2897:fff:fe89:4bce', u'fe80::28ef:84ff:fe03:31b9', u'fe80::2c49:cbff:febb:da8b', u'fe80::3c22:dcff:fe14:e5ef', u'fe80::40cd:bff:fec4:4d10', u'fe80::48f6:b5ff:fe00:e1a9', u'fe80::58fd:e7ff:fe87:2c5a', u'fe80::6818:1aff:fe7b:a6f8', u'fe80::7046:dcff:fe9f:932', u'fe80::745b:5cff:fecd:b69', u'fe80::7462:10ff:fe02:2bf8', u'fe80::8044:26ff:fe38:dbef', u'fe80::80d8:1dff:fea2:4df3', u'fe80::8ccf:11ff:fe7a:7983', u'fe80::8ce2:cdff:fe8e:d2dc', u'fe80::a06f:92ff:fe5c:630b', u'fe80::a09f:70ff:fe26:50d9', u'fe80::a0d4:8bff:fe39:1ac3', u'fe80::ac3c:60ff:fe1d:1881', u'fe80::bc25:24ff:fec7:3467', u'fe80::c0cb:19ff:fed2:eddb', u'fe80::d479:d2ff:fe81:fd4d', u'fe80::dc03:e4ff:fe17:366', u'fe80::e0b6:3fff:fee7:3b02', u'fe80::e0e2:b8ff:fee0:1534', u'fe80::f016:f1ff:fef8:e2dc', u'fe80::f44d:30ff:fe59:c9c5'], in RIB of router r3 for [bgp] route 1::/64    assert "!! Failed: Missing Next hops [u'fe80::8d:34ff:fe69:123a', u'fe80::808:7bff:fe91:4991', u'fe80::c94:45ff:fe5f:85d9', u...:fee0:1534', u'fe80::f016:f1ff:fef8:e2dc', u'fe80::f44d:30ff:fe59:c9c5'], in RIB of router r3 for [bgp] route 1::/64\n" is True
E   AssertionError: Testcase test_ecmp_remove_redistribute_static : Failed 
       Error: !! Failed: Missing Next hops [u'fe80::8d:34ff:fe69:123a', u'fe80::808:7bff:fe91:4991', u'fe80::c94:45ff:fe5f:85d9', u'fe80::2466:e8ff:fe83:c2fb', u'fe80::2864:4cff:fecb:64a6', u'fe80::2897:fff:fe89:4bce', u'fe80::28ef:84ff:fe03:31b9', u'fe80::2c49:cbff:febb:da8b', u'fe80::3c22:dcff:fe14:e5ef', u'fe80::40cd:bff:fec4:4d10', u'fe80::48f6:b5ff:fe00:e1a9', u'fe80::58fd:e7ff:fe87:2c5a', u'fe80::6818:1aff:fe7b:a6f8', u'fe80::7046:dcff:fe9f:932', u'fe80::745b:5cff:fecd:b69', u'fe80::7462:10ff:fe02:2bf8', u'fe80::8044:26ff:fe38:dbef', u'fe80::80d8:1dff:fea2:4df3', u'fe80::8ccf:11ff:fe7a:7983', u'fe80::8ce2:cdff:fe8e:d2dc', u'fe80::a06f:92ff:fe5c:630b', u'fe80::a09f:70ff:fe26:50d9', u'fe80::a0d4:8bff:fe39:1ac3', u'fe80::ac3c:60ff:fe1d:1881', u'fe80::bc25:24ff:fec7:3467', u'fe80::c0cb:19ff:fed2:eddb', u'fe80::d479:d2ff:fe81:fd4d', u'fe80::dc03:e4ff:fe17:366', u'fe80::e0b6:3fff:fee7:3b02', u'fe80::e0e2:b8ff:fee0:1534', u'fe80::f016:f1ff:fef8:e2dc', u'fe80::f44d:30ff:fe59:c9c5'], in RIB of router r3 for [bgp] route 1::/64
      
    assert "!! Failed: Missing Next hops [u'fe80::8d:34ff:fe69:123a', u'fe80::808:7bff:fe91:4991', u'fe80::c94:45ff:fe5f:85d9', u...:fee0:1534', u'fe80::f016:f1ff:fef8:e2dc', u'fe80::f44d:30ff:fe59:c9c5'], in RIB of router r3 for [bgp] route 1::/64\n" is True
Collapse Failed test_ebgp_ecmp_topo2 test_modify_ecmp_max_paths[advertise_nw-32] History
Topology Tests on Ubuntu 18.04 amd64 27 secs
AssertionError: Testcase test_modify_ecmp_max_paths[advertise_nw-32] : Failed     Error: !! Failed: Missing Next hops [u'fe80::8d:34ff:fe69:123a', u'fe80::808:7bff:fe91:4991', u'fe80::c94:45ff:fe5f:85d9', u'fe80::2466:e8ff:fe83:c2fb', u'fe80::2864:4cff:fecb:64a6', u'fe80::2897:fff:fe89:4bce', u'fe80::28ef:84ff:fe03:31b9', u'fe80::2c49:cbff:febb:da8b', u'fe80::3c22:dcff:fe14:e5ef', u'fe80::40cd:bff:fec4:4d10', u'fe80::48f6:b5ff:fe00:e1a9', u'fe80::58fd:e7ff:fe87:2c5a', u'fe80::6818:1aff:fe7b:a6f8', u'fe80::7046:dcff:fe9f:932', u'fe80::745b:5cff:fecd:b69', u'fe80::7462:10ff:fe02:2bf8', u'fe80::8044:26ff:fe38:dbef', u'fe80::80d8:1dff:fea2:4df3', u'fe80::8ccf:11ff:fe7a:7983', u'fe80::8ce2:cdff:fe8e:d2dc', u'fe80::a06f:92ff:fe5c:630b', u'fe80::a09f:70ff:fe26:50d9', u'fe80::a0d4:8bff:fe39:1ac3', u'fe80::ac3c:60ff:fe1d:1881', u'fe80::bc25:24ff:fec7:3467', u'fe80::c0cb:19ff:fed2:eddb', u'fe80::d479:d2ff:fe81:fd4d', u'fe80::dc03:e4ff:fe17:366', u'fe80::e0b6:3fff:fee7:3b02', u'fe80::e0e2:b8ff:fee0:1534', u'fe80::f016:f1ff:fef8:e2dc', u'fe80::f44d:30ff:fe59:c9c5'], in RIB of router r3 for [bgp] route 1::/64    assert "!! Failed: Missing Next hops [u'fe80::8d:34ff:fe69:123a', u'fe80::808:7bff:fe91:4991', u'fe80::c94:45ff:fe5f:85d9', u...:fee0:1534', u'fe80::f016:f1ff:fef8:e2dc', u'fe80::f44d:30ff:fe59:c9c5'], in RIB of router r3 for [bgp] route 1::/64\n" is True
E   AssertionError: Testcase test_modify_ecmp_max_paths[advertise_nw-32] : Failed 
       Error: !! Failed: Missing Next hops [u'fe80::8d:34ff:fe69:123a', u'fe80::808:7bff:fe91:4991', u'fe80::c94:45ff:fe5f:85d9', u'fe80::2466:e8ff:fe83:c2fb', u'fe80::2864:4cff:fecb:64a6', u'fe80::2897:fff:fe89:4bce', u'fe80::28ef:84ff:fe03:31b9', u'fe80::2c49:cbff:febb:da8b', u'fe80::3c22:dcff:fe14:e5ef', u'fe80::40cd:bff:fec4:4d10', u'fe80::48f6:b5ff:fe00:e1a9', u'fe80::58fd:e7ff:fe87:2c5a', u'fe80::6818:1aff:fe7b:a6f8', u'fe80::7046:dcff:fe9f:932', u'fe80::745b:5cff:fecd:b69', u'fe80::7462:10ff:fe02:2bf8', u'fe80::8044:26ff:fe38:dbef', u'fe80::80d8:1dff:fea2:4df3', u'fe80::8ccf:11ff:fe7a:7983', u'fe80::8ce2:cdff:fe8e:d2dc', u'fe80::a06f:92ff:fe5c:630b', u'fe80::a09f:70ff:fe26:50d9', u'fe80::a0d4:8bff:fe39:1ac3', u'fe80::ac3c:60ff:fe1d:1881', u'fe80::bc25:24ff:fec7:3467', u'fe80::c0cb:19ff:fed2:eddb', u'fe80::d479:d2ff:fe81:fd4d', u'fe80::dc03:e4ff:fe17:366', u'fe80::e0b6:3fff:fee7:3b02', u'fe80::e0e2:b8ff:fee0:1534', u'fe80::f016:f1ff:fef8:e2dc', u'fe80::f44d:30ff:fe59:c9c5'], in RIB of router r3 for [bgp] route 1::/64
      
    assert "!! Failed: Missing Next hops [u'fe80::8d:34ff:fe69:123a', u'fe80::808:7bff:fe91:4991', u'fe80::c94:45ff:fe5f:85d9', u...:fee0:1534', u'fe80::f016:f1ff:fef8:e2dc', u'fe80::f44d:30ff:fe59:c9c5'], in RIB of router r3 for [bgp] route 1::/64\n" is True
Collapse Failed test_ebgp_ecmp_topo2 test_modify_ecmp_max_paths[redist_static-8] History
Topology Tests on Ubuntu 18.04 amd64 40 secs
AssertionError: Testcase test_modify_ecmp_max_paths[redist_static-8] : Failed     Error: !! Failed: Missing Next hops [u'fe80::8d:34ff:fe69:123a', u'fe80::808:7bff:fe91:4991', u'fe80::c94:45ff:fe5f:85d9', u'fe80::2466:e8ff:fe83:c2fb', u'fe80::2864:4cff:fecb:64a6', u'fe80::2897:fff:fe89:4bce', u'fe80::28ef:84ff:fe03:31b9', u'fe80::48f6:b5ff:fe00:e1a9'], in RIB of router r3 for [bgp] route 1::/64    assert "!! Failed: Missing Next hops [u'fe80::8d:34ff:fe69:123a', u'fe80::808:7bff:fe91:4991', u'fe80::c94:45ff:fe5f:85d9', u...:fe89:4bce', u'fe80::28ef:84ff:fe03:31b9', u'fe80::48f6:b5ff:fe00:e1a9'], in RIB of router r3 for [bgp] route 1::/64\n" is True
E   AssertionError: Testcase test_modify_ecmp_max_paths[redist_static-8] : Failed 
       Error: !! Failed: Missing Next hops [u'fe80::8d:34ff:fe69:123a', u'fe80::808:7bff:fe91:4991', u'fe80::c94:45ff:fe5f:85d9', u'fe80::2466:e8ff:fe83:c2fb', u'fe80::2864:4cff:fecb:64a6', u'fe80::2897:fff:fe89:4bce', u'fe80::28ef:84ff:fe03:31b9', u'fe80::48f6:b5ff:fe00:e1a9'], in RIB of router r3 for [bgp] route 1::/64
      
    assert "!! Failed: Missing Next hops [u'fe80::8d:34ff:fe69:123a', u'fe80::808:7bff:fe91:4991', u'fe80::c94:45ff:fe5f:85d9', u...:fe89:4bce', u'fe80::28ef:84ff:fe03:31b9', u'fe80::48f6:b5ff:fe00:e1a9'], in RIB of router r3 for [bgp] route 1::/64\n" is True
Collapse Failed test_ebgp_ecmp_topo2 test_modify_ecmp_max_paths[redist_static-16] History
Topology Tests on Ubuntu 18.04 amd64 27 secs
AssertionError: Testcase test_modify_ecmp_max_paths[redist_static-16] : Failed     Error: !! Failed: Missing Next hops [u'fe80::8d:34ff:fe69:123a', u'fe80::808:7bff:fe91:4991', u'fe80::c94:45ff:fe5f:85d9', u'fe80::2466:e8ff:fe83:c2fb', u'fe80::2864:4cff:fecb:64a6', u'fe80::2897:fff:fe89:4bce', u'fe80::28ef:84ff:fe03:31b9', u'fe80::2c49:cbff:febb:da8b', u'fe80::3c22:dcff:fe14:e5ef', u'fe80::40cd:bff:fec4:4d10', u'fe80::48f6:b5ff:fe00:e1a9', u'fe80::58fd:e7ff:fe87:2c5a', u'fe80::6818:1aff:fe7b:a6f8', u'fe80::7046:dcff:fe9f:932', u'fe80::745b:5cff:fecd:b69', u'fe80::7462:10ff:fe02:2bf8'], in RIB of router r3 for [bgp] route 1::/64    assert "!! Failed: Missing Next hops [u'fe80::8d:34ff:fe69:123a', u'fe80::808:7bff:fe91:4991', u'fe80::c94:45ff:fe5f:85d9', u...ff:fe9f:932', u'fe80::745b:5cff:fecd:b69', u'fe80::7462:10ff:fe02:2bf8'], in RIB of router r3 for [bgp] route 1::/64\n" is True
E   AssertionError: Testcase test_modify_ecmp_max_paths[redist_static-16] : Failed 
       Error: !! Failed: Missing Next hops [u'fe80::8d:34ff:fe69:123a', u'fe80::808:7bff:fe91:4991', u'fe80::c94:45ff:fe5f:85d9', u'fe80::2466:e8ff:fe83:c2fb', u'fe80::2864:4cff:fecb:64a6', u'fe80::2897:fff:fe89:4bce', u'fe80::28ef:84ff:fe03:31b9', u'fe80::2c49:cbff:febb:da8b', u'fe80::3c22:dcff:fe14:e5ef', u'fe80::40cd:bff:fec4:4d10', u'fe80::48f6:b5ff:fe00:e1a9', u'fe80::58fd:e7ff:fe87:2c5a', u'fe80::6818:1aff:fe7b:a6f8', u'fe80::7046:dcff:fe9f:932', u'fe80::745b:5cff:fecd:b69', u'fe80::7462:10ff:fe02:2bf8'], in RIB of router r3 for [bgp] route 1::/64
      
    assert "!! Failed: Missing Next hops [u'fe80::8d:34ff:fe69:123a', u'fe80::808:7bff:fe91:4991', u'fe80::c94:45ff:fe5f:85d9', u...ff:fe9f:932', u'fe80::745b:5cff:fecd:b69', u'fe80::7462:10ff:fe02:2bf8'], in RIB of router r3 for [bgp] route 1::/64\n" is True
Collapse Failed test_ebgp_ecmp_topo2 test_modify_ecmp_max_paths[advertise_nw-8] History
Topology Tests on Ubuntu 18.04 amd64 27 secs
AssertionError: Testcase test_modify_ecmp_max_paths[advertise_nw-8] : Failed     Error: !! Failed: Missing Next hops [u'fe80::8d:34ff:fe69:123a', u'fe80::808:7bff:fe91:4991', u'fe80::c94:45ff:fe5f:85d9', u'fe80::2466:e8ff:fe83:c2fb', u'fe80::2864:4cff:fecb:64a6', u'fe80::2897:fff:fe89:4bce', u'fe80::28ef:84ff:fe03:31b9', u'fe80::48f6:b5ff:fe00:e1a9'], in RIB of router r3 for [bgp] route 1::/64    assert "!! Failed: Missing Next hops [u'fe80::8d:34ff:fe69:123a', u'fe80::808:7bff:fe91:4991', u'fe80::c94:45ff:fe5f:85d9', u...:fe89:4bce', u'fe80::28ef:84ff:fe03:31b9', u'fe80::48f6:b5ff:fe00:e1a9'], in RIB of router r3 for [bgp] route 1::/64\n" is True
E   AssertionError: Testcase test_modify_ecmp_max_paths[advertise_nw-8] : Failed 
       Error: !! Failed: Missing Next hops [u'fe80::8d:34ff:fe69:123a', u'fe80::808:7bff:fe91:4991', u'fe80::c94:45ff:fe5f:85d9', u'fe80::2466:e8ff:fe83:c2fb', u'fe80::2864:4cff:fecb:64a6', u'fe80::2897:fff:fe89:4bce', u'fe80::28ef:84ff:fe03:31b9', u'fe80::48f6:b5ff:fe00:e1a9'], in RIB of router r3 for [bgp] route 1::/64
      
    assert "!! Failed: Missing Next hops [u'fe80::8d:34ff:fe69:123a', u'fe80::808:7bff:fe91:4991', u'fe80::c94:45ff:fe5f:85d9', u...:fe89:4bce', u'fe80::28ef:84ff:fe03:31b9', u'fe80::48f6:b5ff:fe00:e1a9'], in RIB of router r3 for [bgp] route 1::/64\n" is True
Collapse Failed test_ebgp_ecmp_topo2 test_ecmp_remove_nw_advertise History
Topology Tests on Ubuntu 18.04 amd64 30 secs
AssertionError: Testcase test_ecmp_remove_nw_advertise : Failed     Error: !! Failed: Missing Next hops [u'fe80::8d:34ff:fe69:123a', u'fe80::808:7bff:fe91:4991', u'fe80::c94:45ff:fe5f:85d9', u'fe80::2466:e8ff:fe83:c2fb', u'fe80::2864:4cff:fecb:64a6', u'fe80::2897:fff:fe89:4bce', u'fe80::28ef:84ff:fe03:31b9', u'fe80::2c49:cbff:febb:da8b', u'fe80::3c22:dcff:fe14:e5ef', u'fe80::40cd:bff:fec4:4d10', u'fe80::48f6:b5ff:fe00:e1a9', u'fe80::58fd:e7ff:fe87:2c5a', u'fe80::6818:1aff:fe7b:a6f8', u'fe80::7046:dcff:fe9f:932', u'fe80::745b:5cff:fecd:b69', u'fe80::7462:10ff:fe02:2bf8', u'fe80::8044:26ff:fe38:dbef', u'fe80::80d8:1dff:fea2:4df3', u'fe80::8ccf:11ff:fe7a:7983', u'fe80::8ce2:cdff:fe8e:d2dc', u'fe80::a06f:92ff:fe5c:630b', u'fe80::a09f:70ff:fe26:50d9', u'fe80::a0d4:8bff:fe39:1ac3', u'fe80::ac3c:60ff:fe1d:1881', u'fe80::bc25:24ff:fec7:3467', u'fe80::c0cb:19ff:fed2:eddb', u'fe80::d479:d2ff:fe81:fd4d', u'fe80::dc03:e4ff:fe17:366', u'fe80::e0b6:3fff:fee7:3b02', u'fe80::e0e2:b8ff:fee0:1534', u'fe80::f016:f1ff:fef8:e2dc', u'fe80::f44d:30ff:fe59:c9c5'], in RIB of router r3 for [bgp] route 1::/64    assert "!! Failed: Missing Next hops [u'fe80::8d:34ff:fe69:123a', u'fe80::808:7bff:fe91:4991', u'fe80::c94:45ff:fe5f:85d9', u...:fee0:1534', u'fe80::f016:f1ff:fef8:e2dc', u'fe80::f44d:30ff:fe59:c9c5'], in RIB of router r3 for [bgp] route 1::/64\n" is True
E   AssertionError: Testcase test_ecmp_remove_nw_advertise : Failed 
       Error: !! Failed: Missing Next hops [u'fe80::8d:34ff:fe69:123a', u'fe80::808:7bff:fe91:4991', u'fe80::c94:45ff:fe5f:85d9', u'fe80::2466:e8ff:fe83:c2fb', u'fe80::2864:4cff:fecb:64a6', u'fe80::2897:fff:fe89:4bce', u'fe80::28ef:84ff:fe03:31b9', u'fe80::2c49:cbff:febb:da8b', u'fe80::3c22:dcff:fe14:e5ef', u'fe80::40cd:bff:fec4:4d10', u'fe80::48f6:b5ff:fe00:e1a9', u'fe80::58fd:e7ff:fe87:2c5a', u'fe80::6818:1aff:fe7b:a6f8', u'fe80::7046:dcff:fe9f:932', u'fe80::745b:5cff:fecd:b69', u'fe80::7462:10ff:fe02:2bf8', u'fe80::8044:26ff:fe38:dbef', u'fe80::80d8:1dff:fea2:4df3', u'fe80::8ccf:11ff:fe7a:7983', u'fe80::8ce2:cdff:fe8e:d2dc', u'fe80::a06f:92ff:fe5c:630b', u'fe80::a09f:70ff:fe26:50d9', u'fe80::a0d4:8bff:fe39:1ac3', u'fe80::ac3c:60ff:fe1d:1881', u'fe80::bc25:24ff:fec7:3467', u'fe80::c0cb:19ff:fed2:eddb', u'fe80::d479:d2ff:fe81:fd4d', u'fe80::dc03:e4ff:fe17:366', u'fe80::e0b6:3fff:fee7:3b02', u'fe80::e0e2:b8ff:fee0:1534', u'fe80::f016:f1ff:fef8:e2dc', u'fe80::f44d:30ff:fe59:c9c5'], in RIB of router r3 for [bgp] route 1::/64
      
    assert "!! Failed: Missing Next hops [u'fe80::8d:34ff:fe69:123a', u'fe80::808:7bff:fe91:4991', u'fe80::c94:45ff:fe5f:85d9', u...:fee0:1534', u'fe80::f016:f1ff:fef8:e2dc', u'fe80::f44d:30ff:fe59:c9c5'], in RIB of router r3 for [bgp] route 1::/64\n" is True
Collapse Failed test_ibgp_ecmp_topo2 test_modify_ecmp_max_paths[advertise_nw-8] History
Topology Tests on Ubuntu 18.04 amd64 27 secs
AssertionError: Testcase test_modify_ecmp_max_paths[advertise_nw-8] : Failed     Error: !! Failed: Missing Next hops [u'fe80::c26:2bff:fe72:15d0', u'fe80::10ed:7bff:fe2d:767a', u'fe80::143b:40ff:fea9:7e2', u'fe80::14b2:2dff:fe72:1aad', u'fe80::187a:34ff:fe25:3527', u'fe80::2c06:62ff:fece:927b', u'fe80::2c14:d3ff:fe04:b9f7', u'fe80::e088:ebff:fe5f:a6e9'], in RIB of router r3 for [bgp] route 1::/64    assert "!! Failed: Missing Next hops [u'fe80::c26:2bff:fe72:15d0', u'fe80::10ed:7bff:fe2d:767a', u'fe80::143b:40ff:fea9:7e2',...:fece:927b', u'fe80::2c14:d3ff:fe04:b9f7', u'fe80::e088:ebff:fe5f:a6e9'], in RIB of router r3 for [bgp] route 1::/64\n" is True
E   AssertionError: Testcase test_modify_ecmp_max_paths[advertise_nw-8] : Failed 
       Error: !! Failed: Missing Next hops [u'fe80::c26:2bff:fe72:15d0', u'fe80::10ed:7bff:fe2d:767a', u'fe80::143b:40ff:fea9:7e2', u'fe80::14b2:2dff:fe72:1aad', u'fe80::187a:34ff:fe25:3527', u'fe80::2c06:62ff:fece:927b', u'fe80::2c14:d3ff:fe04:b9f7', u'fe80::e088:ebff:fe5f:a6e9'], in RIB of router r3 for [bgp] route 1::/64
      
    assert "!! Failed: Missing Next hops [u'fe80::c26:2bff:fe72:15d0', u'fe80::10ed:7bff:fe2d:767a', u'fe80::143b:40ff:fea9:7e2',...:fece:927b', u'fe80::2c14:d3ff:fe04:b9f7', u'fe80::e088:ebff:fe5f:a6e9'], in RIB of router r3 for [bgp] route 1::/64\n" is True
Collapse Failed test_ibgp_ecmp_topo2 test_ecmp_shut_bgp_neighbor History
Topology Tests on Ubuntu 18.04 amd64 27 secs
AssertionError: Testcase test_ecmp_shut_bgp_neighbor : Failed     Error: !! Failed: Missing Next hops [u'fe80::c26:2bff:fe72:15d0', u'fe80::10ed:7bff:fe2d:767a', u'fe80::143b:40ff:fea9:7e2', u'fe80::14b2:2dff:fe72:1aad', u'fe80::187a:34ff:fe25:3527', u'fe80::2c06:62ff:fece:927b', u'fe80::2c14:d3ff:fe04:b9f7', u'fe80::2c3d:86ff:fe1d:1be7', u'fe80::3472:caff:feec:2869', u'fe80::481c:55ff:fe41:98ac', u'fe80::48b4:29ff:fec6:ffef', u'fe80::543f:eaff:fe21:cd7c', u'fe80::7cd8:80ff:fe01:abc8', u'fe80::7cfd:c5ff:fee1:1059', u'fe80::8c1a:c1ff:fef2:bad4', u'fe80::9010:75ff:fe0e:bcf8', u'fe80::982e:60ff:fe14:c110', u'fe80::a437:96ff:fe1f:523', u'fe80::a46e:d9ff:fe77:4b2d', u'fe80::a883:f9ff:fe99:fdb4', u'fe80::ac20:eaff:fe25:afd5', u'fe80::bc38:94ff:fe45:efa6', u'fe80::d0bd:1aff:fe79:a7bf', u'fe80::d0d3:65ff:fe0f:d702', u'fe80::d8bb:47ff:fe47:9d1d', u'fe80::e088:ebff:fe5f:a6e9', u'fe80::e4ed:44ff:fe78:e9ca', u'fe80::e86e:aaff:fe21:18cf', u'fe80::e8bf:e0ff:fe4e:74ee', u'fe80::ec60:cbff:fee6:5655', u'fe80::f401:67ff:fec2:1a63', u'fe80::f43e:95ff:fece:4455'], in RIB of router r3 for [bgp] route 1::/64    assert "!! Failed: Missing Next hops [u'fe80::c26:2bff:fe72:15d0', u'fe80::10ed:7bff:fe2d:767a', u'fe80::143b:40ff:fea9:7e2',...:fee6:5655', u'fe80::f401:67ff:fec2:1a63', u'fe80::f43e:95ff:fece:4455'], in RIB of router r3 for [bgp] route 1::/64\n" is True
E   AssertionError: Testcase test_ecmp_shut_bgp_neighbor : Failed 
       Error: !! Failed: Missing Next hops [u'fe80::c26:2bff:fe72:15d0', u'fe80::10ed:7bff:fe2d:767a', u'fe80::143b:40ff:fea9:7e2', u'fe80::14b2:2dff:fe72:1aad', u'fe80::187a:34ff:fe25:3527', u'fe80::2c06:62ff:fece:927b', u'fe80::2c14:d3ff:fe04:b9f7', u'fe80::2c3d:86ff:fe1d:1be7', u'fe80::3472:caff:feec:2869', u'fe80::481c:55ff:fe41:98ac', u'fe80::48b4:29ff:fec6:ffef', u'fe80::543f:eaff:fe21:cd7c', u'fe80::7cd8:80ff:fe01:abc8', u'fe80::7cfd:c5ff:fee1:1059', u'fe80::8c1a:c1ff:fef2:bad4', u'fe80::9010:75ff:fe0e:bcf8', u'fe80::982e:60ff:fe14:c110', u'fe80::a437:96ff:fe1f:523', u'fe80::a46e:d9ff:fe77:4b2d', u'fe80::a883:f9ff:fe99:fdb4', u'fe80::ac20:eaff:fe25:afd5', u'fe80::bc38:94ff:fe45:efa6', u'fe80::d0bd:1aff:fe79:a7bf', u'fe80::d0d3:65ff:fe0f:d702', u'fe80::d8bb:47ff:fe47:9d1d', u'fe80::e088:ebff:fe5f:a6e9', u'fe80::e4ed:44ff:fe78:e9ca', u'fe80::e86e:aaff:fe21:18cf', u'fe80::e8bf:e0ff:fe4e:74ee', u'fe80::ec60:cbff:fee6:5655', u'fe80::f401:67ff:fec2:1a63', u'fe80::f43e:95ff:fece:4455'], in RIB of router r3 for [bgp] route 1::/64
      
    assert "!! Failed: Missing Next hops [u'fe80::c26:2bff:fe72:15d0', u'fe80::10ed:7bff:fe2d:767a', u'fe80::143b:40ff:fea9:7e2',...:fee6:5655', u'fe80::f401:67ff:fec2:1a63', u'fe80::f43e:95ff:fece:4455'], in RIB of router r3 for [bgp] route 1::/64\n" is True
Collapse Failed test_ibgp_ecmp_topo2 test_modify_ecmp_max_paths[redist_static-8] History
Topology Tests on Ubuntu 18.04 amd64 40 secs
AssertionError: Testcase test_modify_ecmp_max_paths[redist_static-8] : Failed     Error: !! Failed: Missing Next hops [u'fe80::c26:2bff:fe72:15d0', u'fe80::10ed:7bff:fe2d:767a', u'fe80::143b:40ff:fea9:7e2', u'fe80::14b2:2dff:fe72:1aad', u'fe80::187a:34ff:fe25:3527', u'fe80::2c06:62ff:fece:927b', u'fe80::2c14:d3ff:fe04:b9f7', u'fe80::e088:ebff:fe5f:a6e9'], in RIB of router r3 for [bgp] route 1::/64    assert "!! Failed: Missing Next hops [u'fe80::c26:2bff:fe72:15d0', u'fe80::10ed:7bff:fe2d:767a', u'fe80::143b:40ff:fea9:7e2',...:fece:927b', u'fe80::2c14:d3ff:fe04:b9f7', u'fe80::e088:ebff:fe5f:a6e9'], in RIB of router r3 for [bgp] route 1::/64\n" is True
E   AssertionError: Testcase test_modify_ecmp_max_paths[redist_static-8] : Failed 
       Error: !! Failed: Missing Next hops [u'fe80::c26:2bff:fe72:15d0', u'fe80::10ed:7bff:fe2d:767a', u'fe80::143b:40ff:fea9:7e2', u'fe80::14b2:2dff:fe72:1aad', u'fe80::187a:34ff:fe25:3527', u'fe80::2c06:62ff:fece:927b', u'fe80::2c14:d3ff:fe04:b9f7', u'fe80::e088:ebff:fe5f:a6e9'], in RIB of router r3 for [bgp] route 1::/64
      
    assert "!! Failed: Missing Next hops [u'fe80::c26:2bff:fe72:15d0', u'fe80::10ed:7bff:fe2d:767a', u'fe80::143b:40ff:fea9:7e2',...:fece:927b', u'fe80::2c14:d3ff:fe04:b9f7', u'fe80::e088:ebff:fe5f:a6e9'], in RIB of router r3 for [bgp] route 1::/64\n" is True
Collapse Failed test_ibgp_ecmp_topo2 test_ecmp_remove_static_route History
Topology Tests on Ubuntu 18.04 amd64 27 secs
AssertionError: Testcase test_ecmp_remove_static_route : Failed     Error: !! Failed: Missing Next hops [u'fe80::c26:2bff:fe72:15d0', u'fe80::10ed:7bff:fe2d:767a', u'fe80::143b:40ff:fea9:7e2', u'fe80::14b2:2dff:fe72:1aad', u'fe80::187a:34ff:fe25:3527', u'fe80::2c06:62ff:fece:927b', u'fe80::2c14:d3ff:fe04:b9f7', u'fe80::2c3d:86ff:fe1d:1be7', u'fe80::3472:caff:feec:2869', u'fe80::481c:55ff:fe41:98ac', u'fe80::48b4:29ff:fec6:ffef', u'fe80::543f:eaff:fe21:cd7c', u'fe80::7cd8:80ff:fe01:abc8', u'fe80::7cfd:c5ff:fee1:1059', u'fe80::8c1a:c1ff:fef2:bad4', u'fe80::9010:75ff:fe0e:bcf8', u'fe80::982e:60ff:fe14:c110', u'fe80::a437:96ff:fe1f:523', u'fe80::a46e:d9ff:fe77:4b2d', u'fe80::a883:f9ff:fe99:fdb4', u'fe80::ac20:eaff:fe25:afd5', u'fe80::bc38:94ff:fe45:efa6', u'fe80::d0bd:1aff:fe79:a7bf', u'fe80::d0d3:65ff:fe0f:d702', u'fe80::d8bb:47ff:fe47:9d1d', u'fe80::e088:ebff:fe5f:a6e9', u'fe80::e4ed:44ff:fe78:e9ca', u'fe80::e86e:aaff:fe21:18cf', u'fe80::e8bf:e0ff:fe4e:74ee', u'fe80::ec60:cbff:fee6:5655', u'fe80::f401:67ff:fec2:1a63', u'fe80::f43e:95ff:fece:4455'], in RIB of router r3 for [bgp] route 1::/64    assert "!! Failed: Missing Next hops [u'fe80::c26:2bff:fe72:15d0', u'fe80::10ed:7bff:fe2d:767a', u'fe80::143b:40ff:fea9:7e2',...:fee6:5655', u'fe80::f401:67ff:fec2:1a63', u'fe80::f43e:95ff:fece:4455'], in RIB of router r3 for [bgp] route 1::/64\n" is True
E   AssertionError: Testcase test_ecmp_remove_static_route : Failed 
       Error: !! Failed: Missing Next hops [u'fe80::c26:2bff:fe72:15d0', u'fe80::10ed:7bff:fe2d:767a', u'fe80::143b:40ff:fea9:7e2', u'fe80::14b2:2dff:fe72:1aad', u'fe80::187a:34ff:fe25:3527', u'fe80::2c06:62ff:fece:927b', u'fe80::2c14:d3ff:fe04:b9f7', u'fe80::2c3d:86ff:fe1d:1be7', u'fe80::3472:caff:feec:2869', u'fe80::481c:55ff:fe41:98ac', u'fe80::48b4:29ff:fec6:ffef', u'fe80::543f:eaff:fe21:cd7c', u'fe80::7cd8:80ff:fe01:abc8', u'fe80::7cfd:c5ff:fee1:1059', u'fe80::8c1a:c1ff:fef2:bad4', u'fe80::9010:75ff:fe0e:bcf8', u'fe80::982e:60ff:fe14:c110', u'fe80::a437:96ff:fe1f:523', u'fe80::a46e:d9ff:fe77:4b2d', u'fe80::a883:f9ff:fe99:fdb4', u'fe80::ac20:eaff:fe25:afd5', u'fe80::bc38:94ff:fe45:efa6', u'fe80::d0bd:1aff:fe79:a7bf', u'fe80::d0d3:65ff:fe0f:d702', u'fe80::d8bb:47ff:fe47:9d1d', u'fe80::e088:ebff:fe5f:a6e9', u'fe80::e4ed:44ff:fe78:e9ca', u'fe80::e86e:aaff:fe21:18cf', u'fe80::e8bf:e0ff:fe4e:74ee', u'fe80::ec60:cbff:fee6:5655', u'fe80::f401:67ff:fec2:1a63', u'fe80::f43e:95ff:fece:4455'], in RIB of router r3 for [bgp] route 1::/64
      
    assert "!! Failed: Missing Next hops [u'fe80::c26:2bff:fe72:15d0', u'fe80::10ed:7bff:fe2d:767a', u'fe80::143b:40ff:fea9:7e2',...:fee6:5655', u'fe80::f401:67ff:fec2:1a63', u'fe80::f43e:95ff:fece:4455'], in RIB of router r3 for [bgp] route 1::/64\n" is True
Collapse Failed test_ibgp_ecmp_topo2 test_ecmp_remove_redistribute_static History
Topology Tests on Ubuntu 18.04 amd64 27 secs
AssertionError: Testcase test_ecmp_remove_redistribute_static : Failed     Error: !! Failed: Missing Next hops [u'fe80::c26:2bff:fe72:15d0', u'fe80::10ed:7bff:fe2d:767a', u'fe80::143b:40ff:fea9:7e2', u'fe80::14b2:2dff:fe72:1aad', u'fe80::187a:34ff:fe25:3527', u'fe80::2c06:62ff:fece:927b', u'fe80::2c14:d3ff:fe04:b9f7', u'fe80::2c3d:86ff:fe1d:1be7', u'fe80::3472:caff:feec:2869', u'fe80::481c:55ff:fe41:98ac', u'fe80::48b4:29ff:fec6:ffef', u'fe80::543f:eaff:fe21:cd7c', u'fe80::7cd8:80ff:fe01:abc8', u'fe80::7cfd:c5ff:fee1:1059', u'fe80::8c1a:c1ff:fef2:bad4', u'fe80::9010:75ff:fe0e:bcf8', u'fe80::982e:60ff:fe14:c110', u'fe80::a437:96ff:fe1f:523', u'fe80::a46e:d9ff:fe77:4b2d', u'fe80::a883:f9ff:fe99:fdb4', u'fe80::ac20:eaff:fe25:afd5', u'fe80::bc38:94ff:fe45:efa6', u'fe80::d0bd:1aff:fe79:a7bf', u'fe80::d0d3:65ff:fe0f:d702', u'fe80::d8bb:47ff:fe47:9d1d', u'fe80::e088:ebff:fe5f:a6e9', u'fe80::e4ed:44ff:fe78:e9ca', u'fe80::e86e:aaff:fe21:18cf', u'fe80::e8bf:e0ff:fe4e:74ee', u'fe80::ec60:cbff:fee6:5655', u'fe80::f401:67ff:fec2:1a63', u'fe80::f43e:95ff:fece:4455'], in RIB of router r3 for [bgp] route 1::/64    assert "!! Failed: Missing Next hops [u'fe80::c26:2bff:fe72:15d0', u'fe80::10ed:7bff:fe2d:767a', u'fe80::143b:40ff:fea9:7e2',...:fee6:5655', u'fe80::f401:67ff:fec2:1a63', u'fe80::f43e:95ff:fece:4455'], in RIB of router r3 for [bgp] route 1::/64\n" is True
E   AssertionError: Testcase test_ecmp_remove_redistribute_static : Failed 
       Error: !! Failed: Missing Next hops [u'fe80::c26:2bff:fe72:15d0', u'fe80::10ed:7bff:fe2d:767a', u'fe80::143b:40ff:fea9:7e2', u'fe80::14b2:2dff:fe72:1aad', u'fe80::187a:34ff:fe25:3527', u'fe80::2c06:62ff:fece:927b', u'fe80::2c14:d3ff:fe04:b9f7', u'fe80::2c3d:86ff:fe1d:1be7', u'fe80::3472:caff:feec:2869', u'fe80::481c:55ff:fe41:98ac', u'fe80::48b4:29ff:fec6:ffef', u'fe80::543f:eaff:fe21:cd7c', u'fe80::7cd8:80ff:fe01:abc8', u'fe80::7cfd:c5ff:fee1:1059', u'fe80::8c1a:c1ff:fef2:bad4', u'fe80::9010:75ff:fe0e:bcf8', u'fe80::982e:60ff:fe14:c110', u'fe80::a437:96ff:fe1f:523', u'fe80::a46e:d9ff:fe77:4b2d', u'fe80::a883:f9ff:fe99:fdb4', u'fe80::ac20:eaff:fe25:afd5', u'fe80::bc38:94ff:fe45:efa6', u'fe80::d0bd:1aff:fe79:a7bf', u'fe80::d0d3:65ff:fe0f:d702', u'fe80::d8bb:47ff:fe47:9d1d', u'fe80::e088:ebff:fe5f:a6e9', u'fe80::e4ed:44ff:fe78:e9ca', u'fe80::e86e:aaff:fe21:18cf', u'fe80::e8bf:e0ff:fe4e:74ee', u'fe80::ec60:cbff:fee6:5655', u'fe80::f401:67ff:fec2:1a63', u'fe80::f43e:95ff:fece:4455'], in RIB of router r3 for [bgp] route 1::/64
      
    assert "!! Failed: Missing Next hops [u'fe80::c26:2bff:fe72:15d0', u'fe80::10ed:7bff:fe2d:767a', u'fe80::143b:40ff:fea9:7e2',...:fee6:5655', u'fe80::f401:67ff:fec2:1a63', u'fe80::f43e:95ff:fece:4455'], in RIB of router r3 for [bgp] route 1::/64\n" is True
Collapse Failed test_ibgp_ecmp_topo2 test_modify_ecmp_max_paths[advertise_nw-32] History
Topology Tests on Ubuntu 18.04 amd64 27 secs
AssertionError: Testcase test_modify_ecmp_max_paths[advertise_nw-32] : Failed     Error: !! Failed: Missing Next hops [u'fe80::c26:2bff:fe72:15d0', u'fe80::10ed:7bff:fe2d:767a', u'fe80::143b:40ff:fea9:7e2', u'fe80::14b2:2dff:fe72:1aad', u'fe80::187a:34ff:fe25:3527', u'fe80::2c06:62ff:fece:927b', u'fe80::2c14:d3ff:fe04:b9f7', u'fe80::2c3d:86ff:fe1d:1be7', u'fe80::3472:caff:feec:2869', u'fe80::481c:55ff:fe41:98ac', u'fe80::48b4:29ff:fec6:ffef', u'fe80::543f:eaff:fe21:cd7c', u'fe80::7cd8:80ff:fe01:abc8', u'fe80::7cfd:c5ff:fee1:1059', u'fe80::8c1a:c1ff:fef2:bad4', u'fe80::9010:75ff:fe0e:bcf8', u'fe80::982e:60ff:fe14:c110', u'fe80::a437:96ff:fe1f:523', u'fe80::a46e:d9ff:fe77:4b2d', u'fe80::a883:f9ff:fe99:fdb4', u'fe80::ac20:eaff:fe25:afd5', u'fe80::bc38:94ff:fe45:efa6', u'fe80::d0bd:1aff:fe79:a7bf', u'fe80::d0d3:65ff:fe0f:d702', u'fe80::d8bb:47ff:fe47:9d1d', u'fe80::e088:ebff:fe5f:a6e9', u'fe80::e4ed:44ff:fe78:e9ca', u'fe80::e86e:aaff:fe21:18cf', u'fe80::e8bf:e0ff:fe4e:74ee', u'fe80::ec60:cbff:fee6:5655', u'fe80::f401:67ff:fec2:1a63', u'fe80::f43e:95ff:fece:4455'], in RIB of router r3 for [bgp] route 1::/64    assert "!! Failed: Missing Next hops [u'fe80::c26:2bff:fe72:15d0', u'fe80::10ed:7bff:fe2d:767a', u'fe80::143b:40ff:fea9:7e2',...:fee6:5655', u'fe80::f401:67ff:fec2:1a63', u'fe80::f43e:95ff:fece:4455'], in RIB of router r3 for [bgp] route 1::/64\n" is True
E   AssertionError: Testcase test_modify_ecmp_max_paths[advertise_nw-32] : Failed 
       Error: !! Failed: Missing Next hops [u'fe80::c26:2bff:fe72:15d0', u'fe80::10ed:7bff:fe2d:767a', u'fe80::143b:40ff:fea9:7e2', u'fe80::14b2:2dff:fe72:1aad', u'fe80::187a:34ff:fe25:3527', u'fe80::2c06:62ff:fece:927b', u'fe80::2c14:d3ff:fe04:b9f7', u'fe80::2c3d:86ff:fe1d:1be7', u'fe80::3472:caff:feec:2869', u'fe80::481c:55ff:fe41:98ac', u'fe80::48b4:29ff:fec6:ffef', u'fe80::543f:eaff:fe21:cd7c', u'fe80::7cd8:80ff:fe01:abc8', u'fe80::7cfd:c5ff:fee1:1059', u'fe80::8c1a:c1ff:fef2:bad4', u'fe80::9010:75ff:fe0e:bcf8', u'fe80::982e:60ff:fe14:c110', u'fe80::a437:96ff:fe1f:523', u'fe80::a46e:d9ff:fe77:4b2d', u'fe80::a883:f9ff:fe99:fdb4', u'fe80::ac20:eaff:fe25:afd5', u'fe80::bc38:94ff:fe45:efa6', u'fe80::d0bd:1aff:fe79:a7bf', u'fe80::d0d3:65ff:fe0f:d702', u'fe80::d8bb:47ff:fe47:9d1d', u'fe80::e088:ebff:fe5f:a6e9', u'fe80::e4ed:44ff:fe78:e9ca', u'fe80::e86e:aaff:fe21:18cf', u'fe80::e8bf:e0ff:fe4e:74ee', u'fe80::ec60:cbff:fee6:5655', u'fe80::f401:67ff:fec2:1a63', u'fe80::f43e:95ff:fece:4455'], in RIB of router r3 for [bgp] route 1::/64
      
    assert "!! Failed: Missing Next hops [u'fe80::c26:2bff:fe72:15d0', u'fe80::10ed:7bff:fe2d:767a', u'fe80::143b:40ff:fea9:7e2',...:fee6:5655', u'fe80::f401:67ff:fec2:1a63', u'fe80::f43e:95ff:fece:4455'], in RIB of router r3 for [bgp] route 1::/64\n" is True
Collapse Failed test_ibgp_ecmp_topo2 test_modify_ecmp_max_paths[redist_static-16] History
Topology Tests on Ubuntu 18.04 amd64 27 secs
AssertionError: Testcase test_modify_ecmp_max_paths[redist_static-16] : Failed     Error: !! Failed: Missing Next hops [u'fe80::c26:2bff:fe72:15d0', u'fe80::10ed:7bff:fe2d:767a', u'fe80::143b:40ff:fea9:7e2', u'fe80::14b2:2dff:fe72:1aad', u'fe80::187a:34ff:fe25:3527', u'fe80::2c06:62ff:fece:927b', u'fe80::2c14:d3ff:fe04:b9f7', u'fe80::2c3d:86ff:fe1d:1be7', u'fe80::3472:caff:feec:2869', u'fe80::481c:55ff:fe41:98ac', u'fe80::48b4:29ff:fec6:ffef', u'fe80::543f:eaff:fe21:cd7c', u'fe80::7cd8:80ff:fe01:abc8', u'fe80::7cfd:c5ff:fee1:1059', u'fe80::8c1a:c1ff:fef2:bad4', u'fe80::e088:ebff:fe5f:a6e9'], in RIB of router r3 for [bgp] route 1::/64    assert "!! Failed: Missing Next hops [u'fe80::c26:2bff:fe72:15d0', u'fe80::10ed:7bff:fe2d:767a', u'fe80::143b:40ff:fea9:7e2',...:fee1:1059', u'fe80::8c1a:c1ff:fef2:bad4', u'fe80::e088:ebff:fe5f:a6e9'], in RIB of router r3 for [bgp] route 1::/64\n" is True
E   AssertionError: Testcase test_modify_ecmp_max_paths[redist_static-16] : Failed 
       Error: !! Failed: Missing Next hops [u'fe80::c26:2bff:fe72:15d0', u'fe80::10ed:7bff:fe2d:767a', u'fe80::143b:40ff:fea9:7e2', u'fe80::14b2:2dff:fe72:1aad', u'fe80::187a:34ff:fe25:3527', u'fe80::2c06:62ff:fece:927b', u'fe80::2c14:d3ff:fe04:b9f7', u'fe80::2c3d:86ff:fe1d:1be7', u'fe80::3472:caff:feec:2869', u'fe80::481c:55ff:fe41:98ac', u'fe80::48b4:29ff:fec6:ffef', u'fe80::543f:eaff:fe21:cd7c', u'fe80::7cd8:80ff:fe01:abc8', u'fe80::7cfd:c5ff:fee1:1059', u'fe80::8c1a:c1ff:fef2:bad4', u'fe80::e088:ebff:fe5f:a6e9'], in RIB of router r3 for [bgp] route 1::/64
      
    assert "!! Failed: Missing Next hops [u'fe80::c26:2bff:fe72:15d0', u'fe80::10ed:7bff:fe2d:767a', u'fe80::143b:40ff:fea9:7e2',...:fee1:1059', u'fe80::8c1a:c1ff:fef2:bad4', u'fe80::e088:ebff:fe5f:a6e9'], in RIB of router r3 for [bgp] route 1::/64\n" is True
Collapse Failed test_ibgp_ecmp_topo2 test_modify_ecmp_max_paths[advertise_nw-16] History
Topology Tests on Ubuntu 18.04 amd64 27 secs
AssertionError: Testcase test_modify_ecmp_max_paths[advertise_nw-16] : Failed     Error: !! Failed: Missing Next hops [u'fe80::c26:2bff:fe72:15d0', u'fe80::10ed:7bff:fe2d:767a', u'fe80::143b:40ff:fea9:7e2', u'fe80::14b2:2dff:fe72:1aad', u'fe80::187a:34ff:fe25:3527', u'fe80::2c06:62ff:fece:927b', u'fe80::2c14:d3ff:fe04:b9f7', u'fe80::2c3d:86ff:fe1d:1be7', u'fe80::3472:caff:feec:2869', u'fe80::481c:55ff:fe41:98ac', u'fe80::48b4:29ff:fec6:ffef', u'fe80::543f:eaff:fe21:cd7c', u'fe80::7cd8:80ff:fe01:abc8', u'fe80::7cfd:c5ff:fee1:1059', u'fe80::8c1a:c1ff:fef2:bad4', u'fe80::e088:ebff:fe5f:a6e9'], in RIB of router r3 for [bgp] route 1::/64    assert "!! Failed: Missing Next hops [u'fe80::c26:2bff:fe72:15d0', u'fe80::10ed:7bff:fe2d:767a', u'fe80::143b:40ff:fea9:7e2',...:fee1:1059', u'fe80::8c1a:c1ff:fef2:bad4', u'fe80::e088:ebff:fe5f:a6e9'], in RIB of router r3 for [bgp] route 1::/64\n" is True
E   AssertionError: Testcase test_modify_ecmp_max_paths[advertise_nw-16] : Failed 
       Error: !! Failed: Missing Next hops [u'fe80::c26:2bff:fe72:15d0', u'fe80::10ed:7bff:fe2d:767a', u'fe80::143b:40ff:fea9:7e2', u'fe80::14b2:2dff:fe72:1aad', u'fe80::187a:34ff:fe25:3527', u'fe80::2c06:62ff:fece:927b', u'fe80::2c14:d3ff:fe04:b9f7', u'fe80::2c3d:86ff:fe1d:1be7', u'fe80::3472:caff:feec:2869', u'fe80::481c:55ff:fe41:98ac', u'fe80::48b4:29ff:fec6:ffef', u'fe80::543f:eaff:fe21:cd7c', u'fe80::7cd8:80ff:fe01:abc8', u'fe80::7cfd:c5ff:fee1:1059', u'fe80::8c1a:c1ff:fef2:bad4', u'fe80::e088:ebff:fe5f:a6e9'], in RIB of router r3 for [bgp] route 1::/64
      
    assert "!! Failed: Missing Next hops [u'fe80::c26:2bff:fe72:15d0', u'fe80::10ed:7bff:fe2d:767a', u'fe80::143b:40ff:fea9:7e2',...:fee1:1059', u'fe80::8c1a:c1ff:fef2:bad4', u'fe80::e088:ebff:fe5f:a6e9'], in RIB of router r3 for [bgp] route 1::/64\n" is True
Collapse Failed test_ibgp_ecmp_topo2 test_modify_ecmp_max_paths[redist_static-32] History
Topology Tests on Ubuntu 18.04 amd64 27 secs
AssertionError: Testcase test_modify_ecmp_max_paths[redist_static-32] : Failed     Error: !! Failed: Missing Next hops [u'fe80::c26:2bff:fe72:15d0', u'fe80::10ed:7bff:fe2d:767a', u'fe80::143b:40ff:fea9:7e2', u'fe80::14b2:2dff:fe72:1aad', u'fe80::187a:34ff:fe25:3527', u'fe80::2c06:62ff:fece:927b', u'fe80::2c14:d3ff:fe04:b9f7', u'fe80::2c3d:86ff:fe1d:1be7', u'fe80::3472:caff:feec:2869', u'fe80::481c:55ff:fe41:98ac', u'fe80::48b4:29ff:fec6:ffef', u'fe80::543f:eaff:fe21:cd7c', u'fe80::7cd8:80ff:fe01:abc8', u'fe80::7cfd:c5ff:fee1:1059', u'fe80::8c1a:c1ff:fef2:bad4', u'fe80::9010:75ff:fe0e:bcf8', u'fe80::982e:60ff:fe14:c110', u'fe80::a437:96ff:fe1f:523', u'fe80::a46e:d9ff:fe77:4b2d', u'fe80::a883:f9ff:fe99:fdb4', u'fe80::ac20:eaff:fe25:afd5', u'fe80::bc38:94ff:fe45:efa6', u'fe80::d0bd:1aff:fe79:a7bf', u'fe80::d0d3:65ff:fe0f:d702', u'fe80::d8bb:47ff:fe47:9d1d', u'fe80::e088:ebff:fe5f:a6e9', u'fe80::e4ed:44ff:fe78:e9ca', u'fe80::e86e:aaff:fe21:18cf', u'fe80::e8bf:e0ff:fe4e:74ee', u'fe80::ec60:cbff:fee6:5655', u'fe80::f401:67ff:fec2:1a63', u'fe80::f43e:95ff:fece:4455'], in RIB of router r3 for [bgp] route 1::/64    assert "!! Failed: Missing Next hops [u'fe80::c26:2bff:fe72:15d0', u'fe80::10ed:7bff:fe2d:767a', u'fe80::143b:40ff:fea9:7e2',...:fee6:5655', u'fe80::f401:67ff:fec2:1a63', u'fe80::f43e:95ff:fece:4455'], in RIB of router r3 for [bgp] route 1::/64\n" is True
E   AssertionError: Testcase test_modify_ecmp_max_paths[redist_static-32] : Failed 
       Error: !! Failed: Missing Next hops [u'fe80::c26:2bff:fe72:15d0', u'fe80::10ed:7bff:fe2d:767a', u'fe80::143b:40ff:fea9:7e2', u'fe80::14b2:2dff:fe72:1aad', u'fe80::187a:34ff:fe25:3527', u'fe80::2c06:62ff:fece:927b', u'fe80::2c14:d3ff:fe04:b9f7', u'fe80::2c3d:86ff:fe1d:1be7', u'fe80::3472:caff:feec:2869', u'fe80::481c:55ff:fe41:98ac', u'fe80::48b4:29ff:fec6:ffef', u'fe80::543f:eaff:fe21:cd7c', u'fe80::7cd8:80ff:fe01:abc8', u'fe80::7cfd:c5ff:fee1:1059', u'fe80::8c1a:c1ff:fef2:bad4', u'fe80::9010:75ff:fe0e:bcf8', u'fe80::982e:60ff:fe14:c110', u'fe80::a437:96ff:fe1f:523', u'fe80::a46e:d9ff:fe77:4b2d', u'fe80::a883:f9ff:fe99:fdb4', u'fe80::ac20:eaff:fe25:afd5', u'fe80::bc38:94ff:fe45:efa6', u'fe80::d0bd:1aff:fe79:a7bf', u'fe80::d0d3:65ff:fe0f:d702', u'fe80::d8bb:47ff:fe47:9d1d', u'fe80::e088:ebff:fe5f:a6e9', u'fe80::e4ed:44ff:fe78:e9ca', u'fe80::e86e:aaff:fe21:18cf', u'fe80::e8bf:e0ff:fe4e:74ee', u'fe80::ec60:cbff:fee6:5655', u'fe80::f401:67ff:fec2:1a63', u'fe80::f43e:95ff:fece:4455'], in RIB of router r3 for [bgp] route 1::/64
      
    assert "!! Failed: Missing Next hops [u'fe80::c26:2bff:fe72:15d0', u'fe80::10ed:7bff:fe2d:767a', u'fe80::143b:40ff:fea9:7e2',...:fee6:5655', u'fe80::f401:67ff:fec2:1a63', u'fe80::f43e:95ff:fece:4455'], in RIB of router r3 for [bgp] route 1::/64\n" is True
Collapse Failed test_ibgp_ecmp_topo2 test_ecmp_remove_nw_advertise History
Topology Tests on Ubuntu 18.04 amd64 31 secs
AssertionError: Testcase test_ecmp_remove_nw_advertise : Failed     Error: !! Failed: Missing Next hops [u'fe80::c26:2bff:fe72:15d0', u'fe80::10ed:7bff:fe2d:767a', u'fe80::143b:40ff:fea9:7e2', u'fe80::14b2:2dff:fe72:1aad', u'fe80::187a:34ff:fe25:3527', u'fe80::2c06:62ff:fece:927b', u'fe80::2c14:d3ff:fe04:b9f7', u'fe80::2c3d:86ff:fe1d:1be7', u'fe80::3472:caff:feec:2869', u'fe80::481c:55ff:fe41:98ac', u'fe80::48b4:29ff:fec6:ffef', u'fe80::543f:eaff:fe21:cd7c', u'fe80::7cd8:80ff:fe01:abc8', u'fe80::7cfd:c5ff:fee1:1059', u'fe80::8c1a:c1ff:fef2:bad4', u'fe80::9010:75ff:fe0e:bcf8', u'fe80::982e:60ff:fe14:c110', u'fe80::a437:96ff:fe1f:523', u'fe80::a46e:d9ff:fe77:4b2d', u'fe80::a883:f9ff:fe99:fdb4', u'fe80::ac20:eaff:fe25:afd5', u'fe80::bc38:94ff:fe45:efa6', u'fe80::d0bd:1aff:fe79:a7bf', u'fe80::d0d3:65ff:fe0f:d702', u'fe80::d8bb:47ff:fe47:9d1d', u'fe80::e088:ebff:fe5f:a6e9', u'fe80::e4ed:44ff:fe78:e9ca', u'fe80::e86e:aaff:fe21:18cf', u'fe80::e8bf:e0ff:fe4e:74ee', u'fe80::ec60:cbff:fee6:5655', u'fe80::f401:67ff:fec2:1a63', u'fe80::f43e:95ff:fece:4455'], in RIB of router r3 for [bgp] route 1::/64    assert "!! Failed: Missing Next hops [u'fe80::c26:2bff:fe72:15d0', u'fe80::10ed:7bff:fe2d:767a', u'fe80::143b:40ff:fea9:7e2',...:fee6:5655', u'fe80::f401:67ff:fec2:1a63', u'fe80::f43e:95ff:fece:4455'], in RIB of router r3 for [bgp] route 1::/64\n" is True
E   AssertionError: Testcase test_ecmp_remove_nw_advertise : Failed 
       Error: !! Failed: Missing Next hops [u'fe80::c26:2bff:fe72:15d0', u'fe80::10ed:7bff:fe2d:767a', u'fe80::143b:40ff:fea9:7e2', u'fe80::14b2:2dff:fe72:1aad', u'fe80::187a:34ff:fe25:3527', u'fe80::2c06:62ff:fece:927b', u'fe80::2c14:d3ff:fe04:b9f7', u'fe80::2c3d:86ff:fe1d:1be7', u'fe80::3472:caff:feec:2869', u'fe80::481c:55ff:fe41:98ac', u'fe80::48b4:29ff:fec6:ffef', u'fe80::543f:eaff:fe21:cd7c', u'fe80::7cd8:80ff:fe01:abc8', u'fe80::7cfd:c5ff:fee1:1059', u'fe80::8c1a:c1ff:fef2:bad4', u'fe80::9010:75ff:fe0e:bcf8', u'fe80::982e:60ff:fe14:c110', u'fe80::a437:96ff:fe1f:523', u'fe80::a46e:d9ff:fe77:4b2d', u'fe80::a883:f9ff:fe99:fdb4', u'fe80::ac20:eaff:fe25:afd5', u'fe80::bc38:94ff:fe45:efa6', u'fe80::d0bd:1aff:fe79:a7bf', u'fe80::d0d3:65ff:fe0f:d702', u'fe80::d8bb:47ff:fe47:9d1d', u'fe80::e088:ebff:fe5f:a6e9', u'fe80::e4ed:44ff:fe78:e9ca', u'fe80::e86e:aaff:fe21:18cf', u'fe80::e8bf:e0ff:fe4e:74ee', u'fe80::ec60:cbff:fee6:5655', u'fe80::f401:67ff:fec2:1a63', u'fe80::f43e:95ff:fece:4455'], in RIB of router r3 for [bgp] route 1::/64
      
    assert "!! Failed: Missing Next hops [u'fe80::c26:2bff:fe72:15d0', u'fe80::10ed:7bff:fe2d:767a', u'fe80::143b:40ff:fea9:7e2',...:fee6:5655', u'fe80::f401:67ff:fec2:1a63', u'fe80::f43e:95ff:fece:4455'], in RIB of router r3 for [bgp] route 1::/64\n" is True
Collapse Failed test_ibgp_ecmp_topo2 test_ecmp_after_clear_bgp History
Topology Tests on Ubuntu 18.04 amd64 27 secs
AssertionError: Testcase test_ecmp_after_clear_bgp : Failed     Error: !! Failed: Missing Next hops [u'fe80::c26:2bff:fe72:15d0', u'fe80::10ed:7bff:fe2d:767a', u'fe80::143b:40ff:fea9:7e2', u'fe80::14b2:2dff:fe72:1aad', u'fe80::187a:34ff:fe25:3527', u'fe80::2c06:62ff:fece:927b', u'fe80::2c14:d3ff:fe04:b9f7', u'fe80::2c3d:86ff:fe1d:1be7', u'fe80::3472:caff:feec:2869', u'fe80::481c:55ff:fe41:98ac', u'fe80::48b4:29ff:fec6:ffef', u'fe80::543f:eaff:fe21:cd7c', u'fe80::7cd8:80ff:fe01:abc8', u'fe80::7cfd:c5ff:fee1:1059', u'fe80::8c1a:c1ff:fef2:bad4', u'fe80::9010:75ff:fe0e:bcf8', u'fe80::982e:60ff:fe14:c110', u'fe80::a437:96ff:fe1f:523', u'fe80::a46e:d9ff:fe77:4b2d', u'fe80::a883:f9ff:fe99:fdb4', u'fe80::ac20:eaff:fe25:afd5', u'fe80::bc38:94ff:fe45:efa6', u'fe80::d0bd:1aff:fe79:a7bf', u'fe80::d0d3:65ff:fe0f:d702', u'fe80::d8bb:47ff:fe47:9d1d', u'fe80::e088:ebff:fe5f:a6e9', u'fe80::e4ed:44ff:fe78:e9ca', u'fe80::e86e:aaff:fe21:18cf', u'fe80::e8bf:e0ff:fe4e:74ee', u'fe80::ec60:cbff:fee6:5655', u'fe80::f401:67ff:fec2:1a63', u'fe80::f43e:95ff:fece:4455'], in RIB of router r3 for [bgp] route 1::/64    assert "!! Failed: Missing Next hops [u'fe80::c26:2bff:fe72:15d0', u'fe80::10ed:7bff:fe2d:767a', u'fe80::143b:40ff:fea9:7e2',...:fee6:5655', u'fe80::f401:67ff:fec2:1a63', u'fe80::f43e:95ff:fece:4455'], in RIB of router r3 for [bgp] route 1::/64\n" is True
E   AssertionError: Testcase test_ecmp_after_clear_bgp : Failed 
       Error: !! Failed: Missing Next hops [u'fe80::c26:2bff:fe72:15d0', u'fe80::10ed:7bff:fe2d:767a', u'fe80::143b:40ff:fea9:7e2', u'fe80::14b2:2dff:fe72:1aad', u'fe80::187a:34ff:fe25:3527', u'fe80::2c06:62ff:fece:927b', u'fe80::2c14:d3ff:fe04:b9f7', u'fe80::2c3d:86ff:fe1d:1be7', u'fe80::3472:caff:feec:2869', u'fe80::481c:55ff:fe41:98ac', u'fe80::48b4:29ff:fec6:ffef', u'fe80::543f:eaff:fe21:cd7c', u'fe80::7cd8:80ff:fe01:abc8', u'fe80::7cfd:c5ff:fee1:1059', u'fe80::8c1a:c1ff:fef2:bad4', u'fe80::9010:75ff:fe0e:bcf8', u'fe80::982e:60ff:fe14:c110', u'fe80::a437:96ff:fe1f:523', u'fe80::a46e:d9ff:fe77:4b2d', u'fe80::a883:f9ff:fe99:fdb4', u'fe80::ac20:eaff:fe25:afd5', u'fe80::bc38:94ff:fe45:efa6', u'fe80::d0bd:1aff:fe79:a7bf', u'fe80::d0d3:65ff:fe0f:d702', u'fe80::d8bb:47ff:fe47:9d1d', u'fe80::e088:ebff:fe5f:a6e9', u'fe80::e4ed:44ff:fe78:e9ca', u'fe80::e86e:aaff:fe21:18cf', u'fe80::e8bf:e0ff:fe4e:74ee', u'fe80::ec60:cbff:fee6:5655', u'fe80::f401:67ff:fec2:1a63', u'fe80::f43e:95ff:fece:4455'], in RIB of router r3 for [bgp] route 1::/64
      
    assert "!! Failed: Missing Next hops [u'fe80::c26:2bff:fe72:15d0', u'fe80::10ed:7bff:fe2d:767a', u'fe80::143b:40ff:fea9:7e2',...:fee6:5655', u'fe80::f401:67ff:fec2:1a63', u'fe80::f43e:95ff:fece:4455'], in RIB of router r3 for [bgp] route 1::/64\n" is True