FreeRangeRouting Github Pull Request Testing

Build: #8862 failed Custom build by Github Hook with revision master

Build result summary

Details

Completed
Duration
112 minutes
Flags
Custom revisionCustom build
Labels
version=frr-7_1-dev-2538-gb8d70bf56git=https_//github_com/frrouting/frr_gitbuildurl=https_//ci1_netdef_org/browse/frr-frrpullreq-8862branch=master
Revision
e25352de4a340c42ab4b26959e5d63f24a7358c9 e25352de4a340c42ab4b26959e5d63f24a7358c9
Total tests
7032
Failing since
#8861 (Custom build by Github Hook with revision master)
Fixed in
#8863 (Custom build by Github Hook with revision master)

Tests

Custom variables

Custom revision
e25352de4a340c42ab4b26959e5d63f24a7358c9 e25352de4a340c42ab4b26959e5d63f24a7358c9
Name Value
github_base_sha e25352de4a340c42ab4b26959e5d63f24a7358c9
github_pullreq 4964
github_repo FRRouting/frr
github_merge_sha b8d70bf56a74b454be32ad87069c86275c6df710
github_branch master

Comments

  1. Github Hook

    GitHub Merge Request 4964
    for GitHub Repo FRRouting/frr, branch master

    Request to merge from ashish12pant/frr
    Merge Git Commit ID b8d70bf56a74b454be32ad87069c86275c6df710 on top of base Git Commit ID e25352de4a340c42ab4b26959e5d63f24a7358c9

Code commits

Author Commit Message Commit date
Renato Westphal Renato Westphal e25352de4a340c42ab4b26959e5d63f24a7358c9 e25352de4a340c42ab4b26959e5d63f24a7358c9 Merge pull request #4950 from donaldsharp/table_summary
Table summary

Tests

New test failures 3
Status Test View job Duration
Collapse Failed test_bgp_basic_functionality test_bgp_with_loopback_interface History
Topology Tests on Ubuntu 16.04 amd64 3 secs
AssertionError: Link local address not removed for interface %s after 10 retries from router
E   AssertionError: Link local address not removed for interface %s after 10 retries from router
Collapse Failed test_bgp_basic_functionality test_bgp_with_loopback_interface History
Topology Tests on Ubuntu 18.04 amd64 3 secs
AssertionError: Link local address not removed for interface %s after 10 retries from router
E   AssertionError: Link local address not removed for interface %s after 10 retries from router
Collapse Failed test_bgp_basic_functionality test_bgp_with_loopback_interface History
TopoTest Tests on Ubuntu 16.04 i386 4 secs
AssertionError: Link local address not removed for interface %s after 10 retries from router
E   AssertionError: Link local address not removed for interface %s after 10 retries from router