FreeRangeRouting Github Pull Request Testing

Build: #7223 failed

Job: TopoTest Tests on Ubuntu 16.04 i386 failed

Job result summary

Completed
Duration
24 minutes
Flags
Custom revisionCustom build
Agent
mininet-i386-12.lab.netdef.org
Total tests
140
Fixed in
#7224 (Custom build by Github Hook with revision master)

Tests

  • 140 tests in total
  • 2 tests failed
  • 2 failures are new
  • 6 tests were quarantined / skipped
  • 23 minutes taken in total.
New test failures 2
Status Test Duration
Collapse Failed test_bfd_vrf_topo1 test_bfd_fast_convergence History
13 secs
AssertionError: "r1" JSON output mismatches assert json value is different (   --- Expected value   +++ Current value   @@ -2,0 +3,4 @@   +        "diagnostic": "ok",    +        "echo-interval": 50,    +        "id": 2615580038,    +        "multihop": false,    @@ -3,0 +8,4 @@   +        "receive-interval": 300,    +        "remote-diagnostic": "ok",    +        "remote-echo-interval": 50,    +        "remote-id": 2400405271,    @@ -6 +14,4 @@   -        "status": "down"   +        "status": "up",    +        "transmit-interval": 300,    +        "uptime": 16,    +        "vrf": "r1-cust1")
E   AssertionError: "r1" JSON output mismatches
    assert json value is different (
      --- Expected value
      +++ Current value
      @@ -2,0 +3,4 @@
      +        "diagnostic": "ok", 
      +        "echo-interval": 50, 
(13 more lines...)
Collapse Failed test_bfd_vrf_topo1 test_bgp_fast_reconvergence History
3 secs
AssertionError: r4: bgp did not converge assert "10.254.254.1/32" should not exist in json["routes"] (have set([u'10.254.254.4/32', u'10.254.254.3/32', u'10.254.254.2/32', u'10.254.254.1/32'])):   --- Expected value   +++ Current value   @@ -1 +1,22 @@   -null   +[   +    {   +        "aspath": "102 101",    +        "bestpath": true,    +        "network": "10.254.254.1/32",    +        "nexthops": [   +            {   +                "afi": "ipv4",    +                "ip": "192.168.2.2",    +                "used": true   +            }   +        ],    +        "origin": "IGP",    +        "path": "102 101",    +        "pathFrom": "external",    +        "peerId": "192.168.2.2",    +        "prefix": "10.254.254.1",    +        "prefixLen": 32,    +        "valid": true,    +        "weight": 0   +    }   +]
E   AssertionError: r4: bgp did not converge
    assert "10.254.254.1/32" should not exist in json["routes"] (have set([u'10.254.254.4/32', u'10.254.254.3/32', u'10.254.254.2/32', u'10.254.254.1/32'])):
      --- Expected value
      +++ Current value
      @@ -1 +1,22 @@
      -null
      +[
(21 more lines...)

Error summary

The build generated some errors. See the full build log for more details.

dpkg: dependency problems prevent configuration of frr-rpki-rtrlib:
frr-rpki-rtrlib depends on librtr0; however:
  Package librtr0 is not installed.

dpkg: error processing package frr-rpki-rtrlib (--install):
dependency problems - leaving unconfigured
Errors were encountered while processing:
frr-rpki-rtrlib
ci/topotests/run_topotests.sh: line 2: g: command not found
RTNETLINK answers: Invalid argument
RTNETLINK answers: Invalid argument
RTNETLINK answers: Invalid argument
RTNETLINK answers: Invalid argument
RTNETLINK answers: Invalid argument
RTNETLINK answers: Invalid argument
2019-04-11 13:56:54,353 ERROR: 'router_json_cmp' failed after 12.54 seconds
2019-04-11 13:56:54,355 ERROR: assert failed at "test_bfd_vrf_topo1/test_bfd_fast_convergence": "r1" JSON output mismatches
assert json value is different (
  --- Expected value
  +++ Current value
  @@ -2,0 +3,4 @@
  +        "diagnostic": "ok",
  +        "echo-interval": 50,
  +        "id": 2615580038,
  +        "multihop": false,
  @@ -3,0 +8,4 @@
  +        "receive-interval": 300,
  +        "remote-diagnostic": "ok",
  +        "remote-echo-interval": 50,
  +        "remote-id": 2400405271,
  @@ -6 +14,4 @@
  -        "status": "down"
  +        "status": "up",
  +        "transmit-interval": 300,
  +        "uptime": 16,
  +        "vrf": "r1-cust1")
2019-04-11 13:56:58,169 ERROR: 'router_json_cmp' failed after 3.36 seconds
2019-04-11 13:56:58,170 ERROR: assert failed at "test_bfd_vrf_topo1/test_bgp_fast_reconvergence": r4: bgp did not converge
assert "10.254.254.1/32" should not exist in json["routes"] (have set([u'10.254.254.4/32', u'10.254.254.3/32', u'10.254.254.2/32', u'10.254.254.1/32'])):
  --- Expected value
  +++ Current value
  @@ -1 +1,22 @@
  -null
  +[
  +    {
  +        "aspath": "102 101",
  +        "bestpath": true,
  +        "network": "10.254.254.1/32",
  +        "nexthops": [
  +            {
  +                "afi": "ipv4",
  +                "ip": "192.168.2.2",
  +                "used": true
  +            }
  +        ],
  +        "origin": "IGP",
  +        "path": "102 101",
  +        "pathFrom": "external",
  +        "peerId": "192.168.2.2",
  +        "prefix": "10.254.254.1",
  +        "prefixLen": 32,
  +        "valid": true,
  +        "weight": 0
  +    }
  +]
*** defaultIntf: warning: r1 has no interfaces
RTNETLINK answers: Invalid argument
RTNETLINK answers: Invalid argument
RTNETLINK answers: Invalid argument
RTNETLINK answers: Invalid argument
RTNETLINK answers: Invalid argument
RTNETLINK answers: Invalid argument
RTNETLINK answers: Invalid argument
RTNETLINK answers: Invalid argument
*** defaultIntf: warning: lm has no interfaces
RTNETLINK answers: Invalid argument
RTNETLINK answers: Invalid argument
RTNETLINK answers: Invalid argument
RTNETLINK answers: Invalid argument
RTNETLINK answers: Invalid argument
RTNETLINK answers: Invalid argument