FreeRangeRouting Github Pull Request Testing

Build: #13613 failed Custom build by Github Hook with revision master

Build result summary

Details

Completed
Duration
130 minutes
Flags
Custom revisionCustom build
Labels
version=frr-7_4-dev-2231-g964f1d98egit=https_//github_com/frrouting/frr_gitbuildurl=https_//ci1_netdef_org/browse/frr-frrpullreq-13613branch=master
Revision
3a9bc619cf39fe751ac3e17f8e94277d716aa3f3 3a9bc619cf39fe751ac3e17f8e94277d716aa3f3
Total tests
9361

Tests

Custom variables

Custom revision
3a9bc619cf39fe751ac3e17f8e94277d716aa3f3 3a9bc619cf39fe751ac3e17f8e94277d716aa3f3
Name Value
github_base_sha 3a9bc619cf39fe751ac3e17f8e94277d716aa3f3
github_pullreq 6827
github_repo FRRouting/frr
github_merge_sha 964f1d98e25a8d0f1480c6f2644793bf896f1a27
github_branch master

Comments

  1. Github Hook

    GitHub Merge Request 6827
    for GitHub Repo FRRouting/frr, branch master

    Request to merge from maduri111/frr
    Merge Git Commit ID 964f1d98e25a8d0f1480c6f2644793bf896f1a27 on top of base Git Commit ID 3a9bc619cf39fe751ac3e17f8e94277d716aa3f3

Code commits

Author Commit Message Commit date
Renato Westphal Renato Westphal 3a9bc619cf39fe751ac3e17f8e94277d716aa3f3 3a9bc619cf39fe751ac3e17f8e94277d716aa3f3 Merge pull request #6908 from qlyoung/vrrp-add-vrf-module
vrrpd: add frr-vrf yang module

Tests

New test failures 92
Status Test View job Duration
Collapse Failed test_bfd_bgp_cbit_topo3 test_bfd_loss_intermediate History
Topo Tests Part 1 on Ubuntu 18.04 amd64 1 min
AssertionError: "r1" JSON output mismatches assert Generated JSON diff error report:      > $->routes: d1 has element of type 'Array' but the corresponding element in d2 is of type 'Object'
E   AssertionError: "r1" JSON output mismatches
    assert Generated JSON diff error report:
      
      > $->routes: d1 has element of type 'Array' but the corresponding element in d2 is of type 'Object'
Collapse Failed test_bfd_bgp_cbit_topo3 test_bfd_loss_intermediate History
Topo Tests Part 1 on Ubuntu 16.04 i386 1 min
AssertionError: "r1" JSON output mismatches assert Generated JSON diff error report:      > $->routes: d1 has element of type 'Array' but the corresponding element in d2 is of type 'Object'
E   AssertionError: "r1" JSON output mismatches
    assert Generated JSON diff error report:
      
      > $->routes: d1 has element of type 'Array' but the corresponding element in d2 is of type 'Object'
Collapse Failed test_bfd_bgp_cbit_topo3 test_bfd_loss_intermediate History
Topo Tests Part 1 on Ubuntu 18.04 arm8 1 min
AssertionError: "r1" JSON output mismatches assert Generated JSON diff error report:      > $->routes: d1 has element of type 'Array' but the corresponding element in d2 is of type 'Object'
E   AssertionError: "r1" JSON output mismatches
    assert Generated JSON diff error report:
      
      > $->routes: d1 has element of type 'Array' but the corresponding element in d2 is of type 'Object'
Collapse Failed test_bfd_bgp_cbit_topo3 test_bfd_loss_intermediate History
Topo Tests Part 1 on Ubuntu 16.04 amd64 1 min
AssertionError: "r1" JSON output mismatches assert Generated JSON diff error report:      > $->routes: d1 has element of type 'Array' but the corresponding element in d2 is of type 'Object'
E   AssertionError: "r1" JSON output mismatches
    assert Generated JSON diff error report:
      
      > $->routes: d1 has element of type 'Array' but the corresponding element in d2 is of type 'Object'
Collapse Failed test_bfd_topo1 test_bgp_fast_convergence History
Topo Tests Part 1 on Ubuntu 16.04 i386 27 secs
AssertionError: r4: bgp did not converge assert Generated JSON diff error report:      > $->routes: d1 has element of type 'Array' but the corresponding element in d2 is of type 'Object'
E   AssertionError: r4: bgp did not converge
    assert Generated JSON diff error report:
      
      > $->routes: d1 has element of type 'Array' but the corresponding element in d2 is of type 'Object'
Collapse Failed test_bfd_topo1 test_bgp_fast_convergence History
Topo Tests Part 1 on Ubuntu 18.04 arm8 33 secs
AssertionError: r4: bgp did not converge assert Generated JSON diff error report:      > $->routes: d1 has element of type 'Array' but the corresponding element in d2 is of type 'Object'
E   AssertionError: r4: bgp did not converge
    assert Generated JSON diff error report:
      
      > $->routes: d1 has element of type 'Array' but the corresponding element in d2 is of type 'Object'
Collapse Failed test_bfd_topo1 test_bgp_fast_convergence History
Topo Tests Part 1 on Ubuntu 16.04 amd64 27 secs
AssertionError: r4: bgp did not converge assert Generated JSON diff error report:      > $->routes: d1 has element of type 'Array' but the corresponding element in d2 is of type 'Object'
E   AssertionError: r4: bgp did not converge
    assert Generated JSON diff error report:
      
      > $->routes: d1 has element of type 'Array' but the corresponding element in d2 is of type 'Object'
Collapse Failed test_bfd_topo1 test_bgp_fast_convergence History
Topo Tests Part 1 on Ubuntu 18.04 amd64 27 secs
AssertionError: r4: bgp did not converge assert Generated JSON diff error report:      > $->routes: d1 has element of type 'Array' but the corresponding element in d2 is of type 'Object'
E   AssertionError: r4: bgp did not converge
    assert Generated JSON diff error report:
      
      > $->routes: d1 has element of type 'Array' but the corresponding element in d2 is of type 'Object'
Collapse Failed test_bfd_vrf_topo1 test_bgp_fast_convergence History
Topo Tests Part 1 on Ubuntu 18.04 arm8 53 secs
AssertionError: r4: bgp did not converge assert Generated JSON diff error report:      > $->routes: d1 has element of type 'Array' but the corresponding element in d2 is of type 'Object'
E   AssertionError: r4: bgp did not converge
    assert Generated JSON diff error report:
      
      > $->routes: d1 has element of type 'Array' but the corresponding element in d2 is of type 'Object'
Collapse Failed test_bfd_vrf_topo1 test_bgp_fast_convergence History
Topo Tests Part 1 on Ubuntu 18.04 amd64 47 secs
AssertionError: r4: bgp did not converge assert Generated JSON diff error report:      > $->routes: d1 has element of type 'Array' but the corresponding element in d2 is of type 'Object'
E   AssertionError: r4: bgp did not converge
    assert Generated JSON diff error report:
      
      > $->routes: d1 has element of type 'Array' but the corresponding element in d2 is of type 'Object'
Collapse Failed test_bfd_vrf_topo1 test_bgp_fast_convergence History
Topo Tests Part 1 on Ubuntu 16.04 i386 47 secs
AssertionError: r4: bgp did not converge assert Generated JSON diff error report:      > $->routes: d1 has element of type 'Array' but the corresponding element in d2 is of type 'Object'
E   AssertionError: r4: bgp did not converge
    assert Generated JSON diff error report:
      
      > $->routes: d1 has element of type 'Array' but the corresponding element in d2 is of type 'Object'
Collapse Failed test_bfd_vrf_topo1 test_bgp_fast_convergence History
Topo Tests Part 1 on Ubuntu 16.04 amd64 47 secs
AssertionError: r4: bgp did not converge assert Generated JSON diff error report:      > $->routes: d1 has element of type 'Array' but the corresponding element in d2 is of type 'Object'
E   AssertionError: r4: bgp did not converge
    assert Generated JSON diff error report:
      
      > $->routes: d1 has element of type 'Array' but the corresponding element in d2 is of type 'Object'
Collapse Failed test_bgp_as_allow_in test_bgp_allowas_in_sameastoebgp_p1 History
Topo Tests Part 1 on Ubuntu 18.04 amd64 1 min
TypeError: list indices must be integers, not str
E   TypeError: list indices must be integers, not str
Collapse Failed test_bgp_as_allow_in test_bgp_allowas_in_sameastoibgp_p1 History
Topo Tests Part 1 on Ubuntu 18.04 amd64 1 min
TypeError: list indices must be integers, not str
E   TypeError: list indices must be integers, not str
Collapse Failed test_bgp_as_allow_in test_bgp_allowas_in_sameastoibgp_p1 History
Topo Tests Part 1 on Ubuntu 18.04 arm8 1 min
TypeError: list indices must be integers, not str
E   TypeError: list indices must be integers, not str
Collapse Failed test_bgp_as_allow_in test_bgp_allowas_in_sameastoebgp_p1 History
Topo Tests Part 1 on Ubuntu 18.04 arm8 1 min
TypeError: list indices must be integers, not str
E   TypeError: list indices must be integers, not str
Collapse Failed test_bgp_as_allow_in test_bgp_allowas_in_sameastoebgp_p1 History
Topo Tests Part 1 on Ubuntu 16.04 i386 1 min
TypeError: list indices must be integers, not str
E   TypeError: list indices must be integers, not str
Collapse Failed test_bgp_as_allow_in test_bgp_allowas_in_sameastoibgp_p1 History
Topo Tests Part 1 on Ubuntu 16.04 amd64 1 min
TypeError: list indices must be integers, not str
E   TypeError: list indices must be integers, not str
Collapse Failed test_bgp_as_allow_in test_bgp_allowas_in_sameastoebgp_p1 History
Topo Tests Part 1 on Ubuntu 16.04 amd64 1 min
TypeError: list indices must be integers, not str
E   TypeError: list indices must be integers, not str
Collapse Failed test_bgp_as_allow_in test_bgp_allowas_in_sameastoibgp_p1 History
Topo Tests Part 1 on Ubuntu 16.04 i386 1 min
TypeError: list indices must be integers, not str
E   TypeError: list indices must be integers, not str
Collapse Failed test_bgp_ebgp_requires_policy test_ebgp_requires_policy History
Topo Tests Part 1 on Ubuntu 18.04 arm8 1 min
AssertionError: eBGP policy is not working (r2) in "TopoGear<name="r2",links=["r2-eth0"<->"s1-eth1"]> TopoRouter<>" assert False is True
E   AssertionError: eBGP policy is not working (r2) in "TopoGear<name="r2",links=["r2-eth0"<->"s1-eth1"]> TopoRouter<>"
    assert False is True
Collapse Failed test_bgp_ebgp_requires_policy test_ebgp_requires_policy History
Topo Tests Part 1 on Ubuntu 16.04 amd64 50 secs
AssertionError: eBGP policy is not working (r2) in "TopoGear<name="r2",links=["r2-eth0"<->"s1-eth1"]> TopoRouter<>" assert False is True
E   AssertionError: eBGP policy is not working (r2) in "TopoGear<name="r2",links=["r2-eth0"<->"s1-eth1"]> TopoRouter<>"
    assert False is True
Collapse Failed test_bgp_ebgp_requires_policy test_ebgp_requires_policy History
Topo Tests Part 1 on Ubuntu 16.04 i386 49 secs
AssertionError: eBGP policy is not working (r2) in "TopoGear<name="r2",links=["r2-eth0"<->"s1-eth1"]> TopoRouter<>" assert False is True
E   AssertionError: eBGP policy is not working (r2) in "TopoGear<name="r2",links=["r2-eth0"<->"s1-eth1"]> TopoRouter<>"
    assert False is True
Collapse Failed test_bgp_ebgp_requires_policy test_ebgp_requires_policy History
Topo Tests Part 1 on Ubuntu 18.04 amd64 50 secs
AssertionError: eBGP policy is not working (r2) in "TopoGear<name="r2",links=["r2-eth0"<->"s1-eth1"]> TopoRouter<>" assert False is True
E   AssertionError: eBGP policy is not working (r2) in "TopoGear<name="r2",links=["r2-eth0"<->"s1-eth1"]> TopoRouter<>"
    assert False is True
Collapse Failed test_bgp_ecmp_topo1 test_bgp_ecmp History
Topo Tests Part 1 on Ubuntu 16.04 amd64 38 secs
AssertionError: expected multipath routes in "show ip bgp" output assert Generated JSON diff error report:      > $->routes: d1 has element of type 'Array' but the corresponding element in d2 is of type 'Object'
E   AssertionError: expected multipath routes in "show ip bgp" output
    assert Generated JSON diff error report:
      
      > $->routes: d1 has element of type 'Array' but the corresponding element in d2 is of type 'Object'
Collapse Failed test_bgp_ecmp_topo1 test_bgp_ecmp History
Topo Tests Part 1 on Ubuntu 16.04 i386 41 secs
AssertionError: expected multipath routes in "show ip bgp" output assert Generated JSON diff error report:      > $->routes: d1 has element of type 'Array' but the corresponding element in d2 is of type 'Object'
E   AssertionError: expected multipath routes in "show ip bgp" output
    assert Generated JSON diff error report:
      
      > $->routes: d1 has element of type 'Array' but the corresponding element in d2 is of type 'Object'
Collapse Failed test_bgp_ecmp_topo1 test_bgp_ecmp History
Topo Tests Part 1 on Ubuntu 18.04 arm8 53 secs
AssertionError: expected multipath routes in "show ip bgp" output assert Generated JSON diff error report:      > $->routes: d1 has element of type 'Array' but the corresponding element in d2 is of type 'Object'
E   AssertionError: expected multipath routes in "show ip bgp" output
    assert Generated JSON diff error report:
      
      > $->routes: d1 has element of type 'Array' but the corresponding element in d2 is of type 'Object'
Collapse Failed test_bgp_ecmp_topo1 test_bgp_ecmp History
Topo Tests Part 1 on Ubuntu 18.04 amd64 39 secs
AssertionError: expected multipath routes in "show ip bgp" output assert Generated JSON diff error report:      > $->routes: d1 has element of type 'Array' but the corresponding element in d2 is of type 'Object'
E   AssertionError: expected multipath routes in "show ip bgp" output
    assert Generated JSON diff error report:
      
      > $->routes: d1 has element of type 'Array' but the corresponding element in d2 is of type 'Object'
Collapse Failed test_bgp_instance_del_test test_check_routes History
Topo Tests Part 2 on Ubuntu 18.04 amd64 < 1 sec
AttributeError: 'list' object has no attribute 'iterkeys'
E   AttributeError: 'list' object has no attribute 'iterkeys'
Collapse Failed test_bgp_instance_del_test test_check_routes History
Topo Tests Part 2 on Ubuntu 16.04 amd64 < 1 sec
AttributeError: 'list' object has no attribute 'iterkeys'
E   AttributeError: 'list' object has no attribute 'iterkeys'
Collapse Failed test_bgp_instance_del_test test_check_routes History
Topo Tests Part 2 on Ubuntu 16.04 i386 < 1 sec
AttributeError: 'list' object has no attribute 'iterkeys'
E   AttributeError: 'list' object has no attribute 'iterkeys'
Collapse Failed test_bgp_instance_del_test test_check_routes History
Topo Tests Part 2 on Ubuntu 18.04 arm8 < 1 sec
AttributeError: 'list' object has no attribute 'iterkeys'
E   AttributeError: 'list' object has no attribute 'iterkeys'
Collapse Failed test_bgp_l3vpn_to_bgp_vrf test_check_routes History
Topo Tests Part 2 on Ubuntu 18.04 arm8 < 1 sec
AttributeError: 'list' object has no attribute 'iterkeys'
E   AttributeError: 'list' object has no attribute 'iterkeys'
Collapse Failed test_bgp_l3vpn_to_bgp_vrf test_check_routes History
Topo Tests Part 2 on Ubuntu 16.04 i386 < 1 sec
AttributeError: 'list' object has no attribute 'iterkeys'
E   AttributeError: 'list' object has no attribute 'iterkeys'
Collapse Failed test_bgp_l3vpn_to_bgp_vrf test_check_routes History
Topo Tests Part 2 on Ubuntu 16.04 amd64 < 1 sec
AttributeError: 'list' object has no attribute 'iterkeys'
E   AttributeError: 'list' object has no attribute 'iterkeys'
Collapse Failed test_bgp_l3vpn_to_bgp_vrf test_check_routes History
Topo Tests Part 2 on Ubuntu 18.04 amd64 < 1 sec
AttributeError: 'list' object has no attribute 'iterkeys'
E   AttributeError: 'list' object has no attribute 'iterkeys'
Collapse Failed test_bgp_multi_vrf_topo1 test_route_map_within_vrf_to_alter_bgp_attribute_p0[locPrf] History
Topo Tests Part 2 on Ubuntu 16.04 amd64 1 min
TypeError: list indices must be integers, not str
E   TypeError: list indices must be integers, not str
Collapse Failed test_bgp_multi_vrf_topo1 test_route_map_within_vrf_to_alter_bgp_attribute_p0[locPrf] History
Topo Tests Part 2 on Ubuntu 16.04 i386 1 min
TypeError: list indices must be integers, not str
E   TypeError: list indices must be integers, not str
Collapse Failed test_bgp_multi_vrf_topo1 test_route_map_within_vrf_to_alter_bgp_attribute_p0[weight] History
Topo Tests Part 2 on Ubuntu 18.04 amd64 1 min
TypeError: list indices must be integers, not str
E   TypeError: list indices must be integers, not str
Collapse Failed test_bgp_multi_vrf_topo1 test_route_map_within_vrf_to_alter_bgp_attribute_p0[locPrf] History
Topo Tests Part 2 on Ubuntu 18.04 amd64 1 min
TypeError: list indices must be integers, not str
E   TypeError: list indices must be integers, not str
Collapse Failed test_bgp_multi_vrf_topo1 test_route_map_within_vrf_to_alter_bgp_attribute_aspath_p0 History
Topo Tests Part 2 on Ubuntu 18.04 amd64 1 min
TypeError: list indices must be integers, not str
E   TypeError: list indices must be integers, not str
Collapse Failed test_bgp_multi_vrf_topo1 test_route_map_within_vrf_to_alter_bgp_attribute_p0[weight] History
Topo Tests Part 2 on Ubuntu 18.04 arm8 2 mins
TypeError: list indices must be integers, not str
E   TypeError: list indices must be integers, not str
Collapse Failed test_bgp_multi_vrf_topo1 test_route_map_within_vrf_to_alter_bgp_attribute_aspath_p0 History
Topo Tests Part 2 on Ubuntu 16.04 i386 1 min
TypeError: list indices must be integers, not str
E   TypeError: list indices must be integers, not str
Collapse Failed test_bgp_multi_vrf_topo1 test_route_map_within_vrf_to_alter_bgp_attribute_p0[weight] History
Topo Tests Part 2 on Ubuntu 16.04 i386 1 min
TypeError: list indices must be integers, not str
E   TypeError: list indices must be integers, not str
Collapse Failed test_bgp_multi_vrf_topo1 test_route_map_within_vrf_to_alter_bgp_attribute_p0[metric] History
Topo Tests Part 2 on Ubuntu 16.04 i386 1 min
TypeError: list indices must be integers, not str
E   TypeError: list indices must be integers, not str
Collapse Failed test_bgp_multi_vrf_topo1 test_route_map_within_vrf_to_alter_bgp_attribute_p0[metric] History
Topo Tests Part 2 on Ubuntu 18.04 amd64 1 min
TypeError: list indices must be integers, not str
E   TypeError: list indices must be integers, not str
Collapse Failed test_bgp_multi_vrf_topo1 test_route_map_within_vrf_to_alter_bgp_attribute_aspath_p0 History
Topo Tests Part 2 on Ubuntu 16.04 amd64 1 min
TypeError: list indices must be integers, not str
E   TypeError: list indices must be integers, not str
Collapse Failed test_bgp_multi_vrf_topo1 test_route_map_within_vrf_to_alter_bgp_attribute_p0[metric] History
Topo Tests Part 2 on Ubuntu 16.04 amd64 1 min
TypeError: list indices must be integers, not str
E   TypeError: list indices must be integers, not str
Collapse Failed test_bgp_multi_vrf_topo1 test_route_map_within_vrf_to_alter_bgp_attribute_p0[weight] History
Topo Tests Part 2 on Ubuntu 16.04 amd64 1 min
TypeError: list indices must be integers, not str
E   TypeError: list indices must be integers, not str
Collapse Failed test_bgp_multi_vrf_topo1 test_route_map_within_vrf_to_alter_bgp_attribute_p0[locPrf] History
Topo Tests Part 2 on Ubuntu 18.04 arm8 2 mins
TypeError: list indices must be integers, not str
E   TypeError: list indices must be integers, not str

Jira issues

IssueDescriptionStatus
Unknown Issue TypeFRR-7Could not obtain issue details from Jira