Testing PullReq against Topology Tests

Build: #148 failed Custom build by Github Hook with revision master

Build result summary

Details

Completed
Duration
19 minutes
Flags
Custom revisionCustom build
Labels
version=frr-3_0-rc1-2990-g42001664git=https_//github_com/frrouting/topotests_gitbuildurl=https_//ci1_netdef_org/browse/frr-topopr-cf-148branch=master
Revisions
FRR - Topotests
master master
FRR - FreeRangeRouting
420016643c6c19e88d900af524c7c65931c17fbd 420016643c6c19e88d900af524c7c65931c17fbd
Total tests
564
Fixed in
#151 (Custom build by Github Hook with revision master)

Custom variables

Custom revision
master master
Name Value
github_base_sha e7d89a5a985f1436ff22fce499b6f9b351705ce0
github_pullreq 64
github_branch master
github_repo FRRouting/topotests
github_merge_sha 0dd39edc754d9adfa3477eb118a8f6ce5dfdfc88

Comments

  1. Github Hook

    GitHub Merge Request 64
    for GitHub Repo FRRouting/topotests, branch master

    Request to merge from pguibert6WIND/topotests
    Merge Git Commit ID 0dd39edc754d9adfa3477eb118a8f6ce5dfdfc88 on top of base Git Commit ID e7d89a5a985f1436ff22fce499b6f9b351705ce0

Code commits

FRR - Topotests
Author Commit Message Commit date
Martin Winter Martin Winter e7d89a5a985f1436ff22fce499b6f9b351705ce0 e7d89a5a985f1436ff22fce499b6f9b351705ce0 Merge pull request #63 from LabNConsulting/working/bgp_l3vpn_to_bgp_vrf+vrf-timing
bgp_l3vpn_to_bgp_vrf: skip test on arm processors with kernel's older than 4.11
FRR - FreeRangeRouting
Author Commit Message Commit date
Donald Sharp Donald Sharp 420016643c6c19e88d900af524c7c65931c17fbd 420016643c6c19e88d900af524c7c65931c17fbd Merge pull request #1735 from LabNConsulting/working/master/pre-vpn-vrf-leak-indenting
Working/master/pre vpn vrf leak indenting
Donald Sharp Donald Sharp 5651675e438d7162580e45e6a5d4856208e87092 5651675e438d7162580e45e6a5d4856208e87092 Merge pull request #1737 from mkanjari/build-failure
zebra: fix build breakage
mitesh <mitesh@cumulusnetworks.com> mitesh <mitesh@cumulusnetworks.com> 1f2129ecd39bf3b1ae16bfb82f82131ef6ec9511 1f2129ecd39bf3b1ae16bfb82f82131ef6ec9511 zebra: fix build breakage
is_vni_l3 was removed as a part of PR1700. However, it seems to be used in master.
Causing the breakage. Made the changes to not use the API anymore.

Signed-off-by: Mitesh Kanjariya <mitesh@cumulusnetworks.com>
Renato Westphal <renato@openbsd.org> Renato Westphal <renato@openbsd.org> b2a708904aab69f80034c48978d34b4abb5e4519 b2a708904aab69f80034c48978d34b4abb5e4519 Merge pull request #1719 from donaldsharp/rip_split_fuckery
ripd: Fix crash when ip rip split-horizon poisoned-reverse is configed

Tests

New test failures 112
Status Test View job Duration
Collapse Failed test_all_protocol_startup test_isis_interfaces History
TopoTest 2.0 Branch < 1 sec
AssertionError: SHOW ISIS INTERFACE DETAIL failed for router r1:   --- actual SHOW ISIS INTERFACE DETAIL   +++ expected SHOW ISIS OSPF6 INTERFACE DETAIL   @@ -1 +1,28 @@   +Area test:   +  Interface: r1-eth5, State: Up, Active, Circuit Id: 0xXX   +    Type: lan, Level: L1, SNPA: XXXX.XXXX.XXXX   +    Level-1 Information:   +      Metric: 10, Active neighbors: 0   +      Hello interval: 3, Holddown count: 10 (pad)   +      CNSP interval: 10, PSNP interval: 2   +      LAN Priority: 64, is not DIS   +    IP Prefix(es):   +      192.168.5.1/26   +    IPv6 Link-Locals:   +      fe80::XXXX:XXXX:XXXX:XXXX/64   +    IPv6 Prefixes:   +      fc00:0:0:5::1/64       +  Interface: r1-eth6, State: Up, Active, Circuit Id: 0xXX   +    Type: lan, Level: L2, SNPA: XXXX.XXXX.XXXX   +    Level-2 Information:   +      Metric: 10, Active neighbors: 0   +      Hello interval: 3, Holddown count: 10 (pad)   +      CNSP interval: 10, PSNP interval: 2   +      LAN Priority: 64, is not DIS   +    IP Prefix(es):   +      192.168.6.1/26   +    IPv6 Link-Locals:   +      fe80::XXXX:XXXX:XXXX:XXXX/64   +    IPv6 Prefixes:   +      fc00:0:0:6::1/64 assert 1 == 0
E   AssertionError: SHOW ISIS INTERFACE DETAIL failed for router r1:
      --- actual SHOW ISIS INTERFACE DETAIL
      +++ expected SHOW ISIS OSPF6 INTERFACE DETAIL
      @@ -1 +1,28 @@
      +Area test:
      +  Interface: r1-eth5, State: Up, Active, Circuit Id: 0xXX
      +    Type: lan, Level: L1, SNPA: XXXX.XXXX.XXXX
(26 more lines...)
Collapse Failed test_all_protocol_startup test_bgp_ipv6_summary History
TopoTest 2.0 Branch < 1 sec
AssertionError: SHOW BGP IPv6 SUMMARY failed for router r1:   --- actual SHOW BGP IPv6 SUMMARY   +++ expected SHOW BGP IPv6 SUMMARY   @@ -1 +1,8 @@   +BGP router identifier 192.168.0.1, local AS number 100 vrf-id 0   +BGP table version 1   +RIB entries 1, using XXXX bytes of memory   +Peers 4, using XXXX KiB of memory       +Neighbor         V         AS MsgRcvd MsgSent   TblVer  InQ OutQ  Up/Down State/PfxRcd   +fc00:0:0:8::1000 4        100       0       0        0    0    0    never       Active   +fc00:0:0:8::2000 4        200       0       0        0    0    0    never       Active assert 1 == 0
E   AssertionError: SHOW BGP IPv6 SUMMARY failed for router r1:
      --- actual SHOW BGP IPv6 SUMMARY
      +++ expected SHOW BGP IPv6 SUMMARY
      @@ -1 +1,8 @@
      +BGP router identifier 192.168.0.1, local AS number 100 vrf-id 0
      +BGP table version 1
      +RIB entries 1, using XXXX bytes of memory
(6 more lines...)
Collapse Failed test_all_protocol_startup test_bgp_summary History
TopoTest 2.0 Branch < 1 sec
AssertionError: SHOW IP BGP SUMMARY failed for router r1:   --- actual SHOW IP BGP SUMMARY   +++ expected SHOW IP BGP SUMMARY   @@ -1 +1,10 @@   +BGP router identifier 192.168.0.1, local AS number 100 vrf-id 0   +BGP table version 1   +RIB entries 1, using XXXX bytes of memory   +Peers 4, using XXXX KiB of memory       +Neighbor         V         AS MsgRcvd MsgSent   TblVer  InQ OutQ  Up/Down State/PfxRcd   +192.168.7.10     4        100       0       0        0    0    0    never       Active   +192.168.7.20     4        200       0       0        0    0    0    never       Active   +fc00:0:0:8::1000 4        100       0       0        0    0    0    never       Active   +fc00:0:0:8::2000 4        200       0       0        0    0    0    never       Active assert 1 == 0
E   AssertionError: SHOW IP BGP SUMMARY failed for router r1:
      --- actual SHOW IP BGP SUMMARY
      +++ expected SHOW IP BGP SUMMARY
      @@ -1 +1,10 @@
      +BGP router identifier 192.168.0.1, local AS number 100 vrf-id 0
      +BGP table version 1
      +RIB entries 1, using XXXX bytes of memory
(8 more lines...)
Collapse Failed test_all_protocol_startup test_mpls_interfaces History
TopoTest 2.0 Branch < 1 sec
AssertionError: MPLS LDP Interface status failed for router r1:   --- actual MPLS LDP interface status   +++ expected MPLS LDP interface status   @@ -1 +1,3 @@    AF   Interface   State  Uptime   Hello Timers  ac   +ipv4 r1-eth9     ACTIVE xx:xx:xx 5/15           0   +ipv6 r1-eth9     ACTIVE xx:xx:xx 5/15           0 assert 1 == 0
E   AssertionError: MPLS LDP Interface status failed for router r1:
      --- actual MPLS LDP interface status
      +++ expected MPLS LDP interface status
      @@ -1 +1,3 @@
       AF   Interface   State  Uptime   Hello Timers  ac
      +ipv4 r1-eth9     ACTIVE xx:xx:xx 5/15           0
      +ipv6 r1-eth9     ACTIVE xx:xx:xx 5/15           0
(1 more lines...)
Collapse Failed test_all_protocol_startup test_rip_status History
TopoTest 2.0 Branch < 1 sec
AssertionError: IP RIP status failed for router r1:   --- actual IP RIP status   +++ expected IP RIP status   @@ -1 +1,15 @@   -   +Routing Protocol is "rip"   +  Sending updates every 30 seconds with +/-50%, next due in XX seconds   +  Timeout after 180 seconds, garbage collect after 120 seconds   +  Outgoing update filter list for all interface is not set   +  Incoming update filter list for all interface is not set   +  Default redistribution metric is 1   +  Redistributing:   +  Default version control: send version 2, receive version 2    +    Interface        Send  Recv   Key-chain   +    r1-eth1          2     2         +  Routing for Networks:   +    192.168.1.0/26   +  Routing Information Sources:   +    Gateway          BadPackets BadRoutes  Distance Last Update   +  Distance: (default is 120) assert 1 == 0
E   AssertionError: IP RIP status failed for router r1:
      --- actual IP RIP status
      +++ expected IP RIP status
      @@ -1 +1,15 @@
      -
      +Routing Protocol is "rip"
      +  Sending updates every 30 seconds with +/-50%, next due in XX seconds
(14 more lines...)
Collapse Failed test_all_protocol_startup test_bgp_ipv4 History
TopoTest 2.0 Branch < 1 sec
AssertionError: SHOW BGP IPv4 failed for router r1:   --- actual SHOW BGP IPv4   +++ expected SHOW BGP IPv4   @@ -1 +1,7 @@   -No BGP process is configured   +BGP table version is 1, local router ID is 192.168.0.1   +Status codes: s suppressed, d damped, h history, * valid, > best, = multipath,   +              i internal, r RIB-failure, S Stale, R Removed   +Origin codes: i - IGP, e - EGP, ? - incomplete   +   +   Network          Next Hop            Metric LocPrf Weight Path   +*> 192.168.0.0      0.0.0.0                  0         32768 i assert 1 == 0
E   AssertionError: SHOW BGP IPv4 failed for router r1:
      --- actual SHOW BGP IPv4
      +++ expected SHOW BGP IPv4
      @@ -1 +1,7 @@
      -No BGP process is configured
      +BGP table version is 1, local router ID is 192.168.0.1
      +Status codes: s suppressed, d damped, h history, * valid, > best, = multipath,
(6 more lines...)
Collapse Failed test_all_protocol_startup test_bgp_ipv6 History
TopoTest 2.0 Branch < 1 sec
AssertionError: SHOW BGP IPv6 failed for router r1:   --- actual SHOW BGP IPv6   +++ expected SHOW BGP IPv6   @@ -1 +1,7 @@   -No BGP process is configured   +BGP table version is 1, local router ID is 192.168.0.1   +Status codes: s suppressed, d damped, h history, * valid, > best, = multipath,   +              i internal, r RIB-failure, S Stale, R Removed   +Origin codes: i - IGP, e - EGP, ? - incomplete   +   +   Network          Next Hop            Metric LocPrf Weight Path   +*> fc00::/64        ::                       0         32768 i assert 1 == 0
E   AssertionError: SHOW BGP IPv6 failed for router r1:
      --- actual SHOW BGP IPv6
      +++ expected SHOW BGP IPv6
      @@ -1 +1,7 @@
      -No BGP process is configured
      +BGP table version is 1, local router ID is 192.168.0.1
      +Status codes: s suppressed, d damped, h history, * valid, > best, = multipath,
(6 more lines...)
Collapse Failed test_all_protocol_startup test_ripng_status History
TopoTest 2.0 Branch < 1 sec
AssertionError: IPv6 RIPng status failed for router r1:   --- actual IPv6 RIPng status   +++ expected IPv6 RIPng status   @@ -1 +1,14 @@   -   +Routing Protocol is "RIPng"   +  Sending updates every 30 seconds with +/-50%, next due in XX seconds   +  Timeout after 180 seconds, garbage collect after 120 seconds   +  Outgoing update filter list for all interface is not set   +  Incoming update filter list for all interface is not set   +  Default redistribution metric is 1   +  Redistributing:   +  Default version control: send version 1, receive version 1    +    Interface        Send  Recv   +    r1-eth2          1     1     +  Routing for Networks:   +    fc00:0:0:2::/64   +  Routing Information Sources:   +    Gateway          BadPackets BadRoutes  Distance Last Update assert 1 == 0
E   AssertionError: IPv6 RIPng status failed for router r1:
      --- actual IPv6 RIPng status
      +++ expected IPv6 RIPng status
      @@ -1 +1,14 @@
      -
      +Routing Protocol is "RIPng"
      +  Sending updates every 30 seconds with +/-50%, next due in XX seconds
(13 more lines...)
Collapse Failed test_all_protocol_startup test_isis_interfaces History
TopoTest 3.0 Branch < 1 sec
AssertionError: SHOW ISIS INTERFACE DETAIL failed for router r1:   --- actual SHOW ISIS INTERFACE DETAIL   +++ expected SHOW ISIS OSPF6 INTERFACE DETAIL   @@ -1 +1,28 @@   +Area test:   +  Interface: r1-eth5, State: Up, Active, Circuit Id: 0xXX   +    Type: lan, Level: L1, SNPA: XXXX.XXXX.XXXX   +    Level-1 Information:   +      Metric: 10, Active neighbors: 0   +      Hello interval: 3, Holddown count: 10 (pad)   +      CNSP interval: 10, PSNP interval: 2   +      LAN Priority: 64, is not DIS   +    IP Prefix(es):   +      192.168.5.1/26   +    IPv6 Link-Locals:   +      fe80::XXXX:XXXX:XXXX:XXXX/64   +    IPv6 Prefixes:   +      fc00:0:0:5::1/64       +  Interface: r1-eth6, State: Up, Active, Circuit Id: 0xXX   +    Type: lan, Level: L2, SNPA: XXXX.XXXX.XXXX   +    Level-2 Information:   +      Metric: 10, Active neighbors: 0   +      Hello interval: 3, Holddown count: 10 (pad)   +      CNSP interval: 10, PSNP interval: 2   +      LAN Priority: 64, is not DIS   +    IP Prefix(es):   +      192.168.6.1/26   +    IPv6 Link-Locals:   +      fe80::XXXX:XXXX:XXXX:XXXX/64   +    IPv6 Prefixes:   +      fc00:0:0:6::1/64 assert 1 == 0
E   AssertionError: SHOW ISIS INTERFACE DETAIL failed for router r1:
      --- actual SHOW ISIS INTERFACE DETAIL
      +++ expected SHOW ISIS OSPF6 INTERFACE DETAIL
      @@ -1 +1,28 @@
      +Area test:
      +  Interface: r1-eth5, State: Up, Active, Circuit Id: 0xXX
      +    Type: lan, Level: L1, SNPA: XXXX.XXXX.XXXX
(26 more lines...)
Collapse Failed test_all_protocol_startup test_bgp_ipv6_summary History
TopoTest 3.0 Branch < 1 sec
AssertionError: SHOW BGP IPv6 SUMMARY failed for router r1:   --- actual SHOW BGP IPv6 SUMMARY   +++ expected SHOW BGP IPv6 SUMMARY   @@ -1 +1,8 @@   +BGP router identifier 192.168.0.1, local AS number 100 vrf-id 0   +BGP table version 1   +RIB entries 1, using XXXX bytes of memory   +Peers 4, using XXXX KiB of memory       +Neighbor         V         AS MsgRcvd MsgSent   TblVer  InQ OutQ  Up/Down State/PfxRcd   +fc00:0:0:8::1000 4        100       0       0        0    0    0    never       Active   +fc00:0:0:8::2000 4        200       0       0        0    0    0    never       Active assert 1 == 0
E   AssertionError: SHOW BGP IPv6 SUMMARY failed for router r1:
      --- actual SHOW BGP IPv6 SUMMARY
      +++ expected SHOW BGP IPv6 SUMMARY
      @@ -1 +1,8 @@
      +BGP router identifier 192.168.0.1, local AS number 100 vrf-id 0
      +BGP table version 1
      +RIB entries 1, using XXXX bytes of memory
(6 more lines...)
Collapse Failed test_all_protocol_startup test_bgp_summary History
TopoTest 3.0 Branch < 1 sec
AssertionError: SHOW IP BGP SUMMARY failed for router r1:   --- actual SHOW IP BGP SUMMARY   +++ expected SHOW IP BGP SUMMARY   @@ -1 +1,10 @@   +BGP router identifier 192.168.0.1, local AS number 100 vrf-id 0   +BGP table version 1   +RIB entries 1, using XXXX bytes of memory   +Peers 4, using XXXX KiB of memory       +Neighbor         V         AS MsgRcvd MsgSent   TblVer  InQ OutQ  Up/Down State/PfxRcd   +192.168.7.10     4        100       0       0        0    0    0    never       Active   +192.168.7.20     4        200       0       0        0    0    0    never       Active   +fc00:0:0:8::1000 4        100       0       0        0    0    0    never       Active   +fc00:0:0:8::2000 4        200       0       0        0    0    0    never       Active assert 1 == 0
E   AssertionError: SHOW IP BGP SUMMARY failed for router r1:
      --- actual SHOW IP BGP SUMMARY
      +++ expected SHOW IP BGP SUMMARY
      @@ -1 +1,10 @@
      +BGP router identifier 192.168.0.1, local AS number 100 vrf-id 0
      +BGP table version 1
      +RIB entries 1, using XXXX bytes of memory
(8 more lines...)
Collapse Failed test_all_protocol_startup test_mpls_interfaces History
TopoTest 3.0 Branch < 1 sec
AssertionError: MPLS LDP Interface status failed for router r1:   --- actual MPLS LDP interface status   +++ expected MPLS LDP interface status   @@ -1 +1,3 @@    AF   Interface   State  Uptime   Hello Timers  ac   +ipv4 r1-eth9     ACTIVE xx:xx:xx 5/15           0   +ipv6 r1-eth9     ACTIVE xx:xx:xx 5/15           0 assert 1 == 0
E   AssertionError: MPLS LDP Interface status failed for router r1:
      --- actual MPLS LDP interface status
      +++ expected MPLS LDP interface status
      @@ -1 +1,3 @@
       AF   Interface   State  Uptime   Hello Timers  ac
      +ipv4 r1-eth9     ACTIVE xx:xx:xx 5/15           0
      +ipv6 r1-eth9     ACTIVE xx:xx:xx 5/15           0
(1 more lines...)
Collapse Failed test_all_protocol_startup test_rip_status History
TopoTest 3.0 Branch < 1 sec
AssertionError: IP RIP status failed for router r1:   --- actual IP RIP status   +++ expected IP RIP status   @@ -1 +1,15 @@   -   +Routing Protocol is "rip"   +  Sending updates every 30 seconds with +/-50%, next due in XX seconds   +  Timeout after 180 seconds, garbage collect after 120 seconds   +  Outgoing update filter list for all interface is not set   +  Incoming update filter list for all interface is not set   +  Default redistribution metric is 1   +  Redistributing:   +  Default version control: send version 2, receive version 2    +    Interface        Send  Recv   Key-chain   +    r1-eth1          2     2         +  Routing for Networks:   +    192.168.1.0/26   +  Routing Information Sources:   +    Gateway          BadPackets BadRoutes  Distance Last Update   +  Distance: (default is 120) assert 1 == 0
E   AssertionError: IP RIP status failed for router r1:
      --- actual IP RIP status
      +++ expected IP RIP status
      @@ -1 +1,15 @@
      -
      +Routing Protocol is "rip"
      +  Sending updates every 30 seconds with +/-50%, next due in XX seconds
(14 more lines...)
Collapse Failed test_all_protocol_startup test_bgp_ipv4 History
TopoTest 3.0 Branch < 1 sec
AssertionError: SHOW BGP IPv4 failed for router r1:   --- actual SHOW BGP IPv4   +++ expected SHOW BGP IPv4   @@ -1 +1,7 @@   -Unable to find default BGP instance   +BGP table version is 1, local router ID is 192.168.0.1   +Status codes: s suppressed, d damped, h history, * valid, > best, = multipath,   +              i internal, r RIB-failure, S Stale, R Removed   +Origin codes: i - IGP, e - EGP, ? - incomplete   +   +   Network          Next Hop            Metric LocPrf Weight Path   +*> 192.168.0.0      0.0.0.0                  0         32768 i assert 1 == 0
E   AssertionError: SHOW BGP IPv4 failed for router r1:
      --- actual SHOW BGP IPv4
      +++ expected SHOW BGP IPv4
      @@ -1 +1,7 @@
      -Unable to find default BGP instance
      +BGP table version is 1, local router ID is 192.168.0.1
      +Status codes: s suppressed, d damped, h history, * valid, > best, = multipath,
(6 more lines...)
Collapse Failed test_all_protocol_startup test_bgp_ipv6 History
TopoTest 3.0 Branch < 1 sec
AssertionError: SHOW BGP IPv6 failed for router r1:   --- actual SHOW BGP IPv6   +++ expected SHOW BGP IPv6   @@ -1 +1,7 @@   -Unable to find default BGP instance   +BGP table version is 1, local router ID is 192.168.0.1   +Status codes: s suppressed, d damped, h history, * valid, > best, = multipath,   +              i internal, r RIB-failure, S Stale, R Removed   +Origin codes: i - IGP, e - EGP, ? - incomplete   +   +   Network          Next Hop            Metric LocPrf Weight Path   +*> fc00::/64        ::                       0         32768 i assert 1 == 0
E   AssertionError: SHOW BGP IPv6 failed for router r1:
      --- actual SHOW BGP IPv6
      +++ expected SHOW BGP IPv6
      @@ -1 +1,7 @@
      -Unable to find default BGP instance
      +BGP table version is 1, local router ID is 192.168.0.1
      +Status codes: s suppressed, d damped, h history, * valid, > best, = multipath,
(6 more lines...)
Collapse Failed test_all_protocol_startup test_ripng_status History
TopoTest 3.0 Branch < 1 sec
AssertionError: IPv6 RIPng status failed for router r1:   --- actual IPv6 RIPng status   +++ expected IPv6 RIPng status   @@ -1 +1,14 @@   -   +Routing Protocol is "RIPng"   +  Sending updates every 30 seconds with +/-50%, next due in XX seconds   +  Timeout after 180 seconds, garbage collect after 120 seconds   +  Outgoing update filter list for all interface is not set   +  Incoming update filter list for all interface is not set   +  Default redistribution metric is 1   +  Redistributing:   +  Default version control: send version 1, receive version 1    +    Interface        Send  Recv   +    r1-eth2          1     1     +  Routing for Networks:   +    fc00:0:0:2::/64   +  Routing Information Sources:   +    Gateway          BadPackets BadRoutes  Distance Last Update assert 1 == 0
E   AssertionError: IPv6 RIPng status failed for router r1:
      --- actual IPv6 RIPng status
      +++ expected IPv6 RIPng status
      @@ -1 +1,14 @@
      -
      +Routing Protocol is "RIPng"
      +  Sending updates every 30 seconds with +/-50%, next due in XX seconds
(13 more lines...)
Collapse Failed test_all_protocol_startup test_mpls_interfaces History
TopoTest Master amd64 < 1 sec
AssertionError: MPLS LDP Interface status failed for router r1:   --- actual MPLS LDP interface status   +++ expected MPLS LDP interface status   @@ -1 +1,3 @@    AF   Interface   State  Uptime   Hello Timers  ac   +ipv4 r1-eth9     ACTIVE xx:xx:xx 5/15           0   +ipv6 r1-eth9     ACTIVE xx:xx:xx 5/15           0 assert 1 == 0
E   AssertionError: MPLS LDP Interface status failed for router r1:
      --- actual MPLS LDP interface status
      +++ expected MPLS LDP interface status
      @@ -1 +1,3 @@
       AF   Interface   State  Uptime   Hello Timers  ac
      +ipv4 r1-eth9     ACTIVE xx:xx:xx 5/15           0
      +ipv6 r1-eth9     ACTIVE xx:xx:xx 5/15           0
(1 more lines...)
Collapse Failed test_all_protocol_startup test_bgp_ipv6_summary History
TopoTest Master amd64 < 1 sec
AssertionError: SHOW BGP IPv6 SUMMARY failed for router r1:   --- actual SHOW BGP IPv6 SUMMARY   +++ expected SHOW BGP IPv6 SUMMARY   @@ -1 +1,8 @@   +BGP router identifier 192.168.0.1, local AS number 100 vrf-id 0   +BGP table version 1   +RIB entries 1, using XXXX bytes of memory   +Peers 4, using XXXX KiB of memory       +Neighbor         V         AS MsgRcvd MsgSent   TblVer  InQ OutQ  Up/Down State/PfxRcd   +fc00:0:0:8::1000 4        100       0       0        0    0    0    never       Active   +fc00:0:0:8::2000 4        200       0       0        0    0    0    never       Active assert 1 == 0
E   AssertionError: SHOW BGP IPv6 SUMMARY failed for router r1:
      --- actual SHOW BGP IPv6 SUMMARY
      +++ expected SHOW BGP IPv6 SUMMARY
      @@ -1 +1,8 @@
      +BGP router identifier 192.168.0.1, local AS number 100 vrf-id 0
      +BGP table version 1
      +RIB entries 1, using XXXX bytes of memory
(6 more lines...)
Collapse Failed test_all_protocol_startup test_rip_status History
TopoTest Master amd64 < 1 sec
AssertionError: IP RIP status failed for router r1:   --- actual IP RIP status   +++ expected IP RIP status   @@ -1 +1,15 @@   -   +Routing Protocol is "rip"   +  Sending updates every 30 seconds with +/-50%, next due in XX seconds   +  Timeout after 180 seconds, garbage collect after 120 seconds   +  Outgoing update filter list for all interface is not set   +  Incoming update filter list for all interface is not set   +  Default redistribution metric is 1   +  Redistributing:   +  Default version control: send version 2, receive version 2    +    Interface        Send  Recv   Key-chain   +    r1-eth1          2     2         +  Routing for Networks:   +    192.168.1.0/26   +  Routing Information Sources:   +    Gateway          BadPackets BadRoutes  Distance Last Update   +  Distance: (default is 120) assert 1 == 0
E   AssertionError: IP RIP status failed for router r1:
      --- actual IP RIP status
      +++ expected IP RIP status
      @@ -1 +1,15 @@
      -
      +Routing Protocol is "rip"
      +  Sending updates every 30 seconds with +/-50%, next due in XX seconds
(14 more lines...)
Collapse Failed test_all_protocol_startup test_bgp_summary History
TopoTest Master amd64 < 1 sec
AssertionError: SHOW IP BGP SUMMARY failed for router r1:   --- actual SHOW IP BGP SUMMARY   +++ expected SHOW IP BGP SUMMARY   @@ -1 +1,10 @@   +BGP router identifier 192.168.0.1, local AS number 100 vrf-id 0   +BGP table version 1   +RIB entries 1, using XXXX bytes of memory   +Peers 4, using XXXX KiB of memory       +Neighbor         V         AS MsgRcvd MsgSent   TblVer  InQ OutQ  Up/Down State/PfxRcd   +192.168.7.10     4        100       0       0        0    0    0    never       Active   +192.168.7.20     4        200       0       0        0    0    0    never       Active   +fc00:0:0:8::1000 4        100       0       0        0    0    0    never       Active   +fc00:0:0:8::2000 4        200       0       0        0    0    0    never       Active assert 1 == 0
E   AssertionError: SHOW IP BGP SUMMARY failed for router r1:
      --- actual SHOW IP BGP SUMMARY
      +++ expected SHOW IP BGP SUMMARY
      @@ -1 +1,10 @@
      +BGP router identifier 192.168.0.1, local AS number 100 vrf-id 0
      +BGP table version 1
      +RIB entries 1, using XXXX bytes of memory
(8 more lines...)
Collapse Failed test_all_protocol_startup test_isis_interfaces History
TopoTest Master amd64 < 1 sec
AssertionError: SHOW ISIS INTERFACE DETAIL failed for router r1:   --- actual SHOW ISIS INTERFACE DETAIL   +++ expected SHOW ISIS OSPF6 INTERFACE DETAIL   @@ -1 +1,28 @@   +Area test:   +  Interface: r1-eth5, State: Up, Active, Circuit Id: 0xXX   +    Type: lan, Level: L1, SNPA: XXXX.XXXX.XXXX   +    Level-1 Information:   +      Metric: 10, Active neighbors: 0   +      Hello interval: 3, Holddown count: 10 (pad)   +      CNSP interval: 10, PSNP interval: 2   +      LAN Priority: 64, is not DIS   +    IP Prefix(es):   +      192.168.5.1/26   +    IPv6 Link-Locals:   +      fe80::XXXX:XXXX:XXXX:XXXX/64   +    IPv6 Prefixes:   +      fc00:0:0:5::1/64       +  Interface: r1-eth6, State: Up, Active, Circuit Id: 0xXX   +    Type: lan, Level: L2, SNPA: XXXX.XXXX.XXXX   +    Level-2 Information:   +      Metric: 10, Active neighbors: 0   +      Hello interval: 3, Holddown count: 10 (pad)   +      CNSP interval: 10, PSNP interval: 2   +      LAN Priority: 64, is not DIS   +    IP Prefix(es):   +      192.168.6.1/26   +    IPv6 Link-Locals:   +      fe80::XXXX:XXXX:XXXX:XXXX/64   +    IPv6 Prefixes:   +      fc00:0:0:6::1/64 assert 1 == 0
E   AssertionError: SHOW ISIS INTERFACE DETAIL failed for router r1:
      --- actual SHOW ISIS INTERFACE DETAIL
      +++ expected SHOW ISIS OSPF6 INTERFACE DETAIL
      @@ -1 +1,28 @@
      +Area test:
      +  Interface: r1-eth5, State: Up, Active, Circuit Id: 0xXX
      +    Type: lan, Level: L1, SNPA: XXXX.XXXX.XXXX
(26 more lines...)
Collapse Failed test_all_protocol_startup test_ripng_status History
TopoTest Master amd64 < 1 sec
AssertionError: IPv6 RIPng status failed for router r1:   --- actual IPv6 RIPng status   +++ expected IPv6 RIPng status   @@ -1 +1,14 @@   -   +Routing Protocol is "RIPng"   +  Sending updates every 30 seconds with +/-50%, next due in XX seconds   +  Timeout after 180 seconds, garbage collect after 120 seconds   +  Outgoing update filter list for all interface is not set   +  Incoming update filter list for all interface is not set   +  Default redistribution metric is 1   +  Redistributing:   +  Default version control: send version 1, receive version 1    +    Interface        Send  Recv   +    r1-eth2          1     1     +  Routing for Networks:   +    fc00:0:0:2::/64   +  Routing Information Sources:   +    Gateway          BadPackets BadRoutes  Distance Last Update assert 1 == 0
E   AssertionError: IPv6 RIPng status failed for router r1:
      --- actual IPv6 RIPng status
      +++ expected IPv6 RIPng status
      @@ -1 +1,14 @@
      -
      +Routing Protocol is "RIPng"
      +  Sending updates every 30 seconds with +/-50%, next due in XX seconds
(13 more lines...)
Collapse Failed test_all_protocol_startup test_bgp_ipv6 History
TopoTest Master amd64 < 1 sec
AssertionError: SHOW BGP IPv6 failed for router r1:   --- actual SHOW BGP IPv6   +++ expected SHOW BGP IPv6   @@ -1 +1,7 @@   -Unable to find default BGP instance   +BGP table version is 1, local router ID is 192.168.0.1   +Status codes: s suppressed, d damped, h history, * valid, > best, = multipath,   +              i internal, r RIB-failure, S Stale, R Removed   +Origin codes: i - IGP, e - EGP, ? - incomplete   +   +   Network          Next Hop            Metric LocPrf Weight Path   +*> fc00::/64        ::                       0         32768 i assert 1 == 0
E   AssertionError: SHOW BGP IPv6 failed for router r1:
      --- actual SHOW BGP IPv6
      +++ expected SHOW BGP IPv6
      @@ -1 +1,7 @@
      -Unable to find default BGP instance
      +BGP table version is 1, local router ID is 192.168.0.1
      +Status codes: s suppressed, d damped, h history, * valid, > best, = multipath,
(6 more lines...)
Collapse Failed test_all_protocol_startup test_bgp_ipv4 History
TopoTest Master amd64 < 1 sec
AssertionError: SHOW BGP IPv4 failed for router r1:   --- actual SHOW BGP IPv4   +++ expected SHOW BGP IPv4   @@ -1 +1,7 @@   -Unable to find default BGP instance   +BGP table version is 1, local router ID is 192.168.0.1   +Status codes: s suppressed, d damped, h history, * valid, > best, = multipath,   +              i internal, r RIB-failure, S Stale, R Removed   +Origin codes: i - IGP, e - EGP, ? - incomplete   +   +   Network          Next Hop            Metric LocPrf Weight Path   +*> 192.168.0.0      0.0.0.0                  0         32768 i assert 1 == 0
E   AssertionError: SHOW BGP IPv4 failed for router r1:
      --- actual SHOW BGP IPv4
      +++ expected SHOW BGP IPv4
      @@ -1 +1,7 @@
      -Unable to find default BGP instance
      +BGP table version is 1, local router ID is 192.168.0.1
      +Status codes: s suppressed, d damped, h history, * valid, > best, = multipath,
(6 more lines...)
Collapse Failed test_bgp_multiview_topo1 test_bgp_routingTable History
TopoTest 2.0 Branch < 1 sec
AssertionError: Routing Table verification failed for router r1, view 1:   --- actual BGP routing table   +++ expected BGP routing table   @@ -1 +1,40 @@   -Can't find BGP instance 1   +BGP table version is XXX, local router ID is 172.30.1.1   +Status codes: s suppressed, d damped, h history, * valid, > best, = multipath,   +              i internal, r RIB-failure, S Stale, R Removed   +Origin codes: i - IGP, e - EGP, ? - incomplete   +   +   Network          Next Hop            Metric LocPrf Weight Path   +*  10.0.1.0/24      172.16.1.5                             0 65005 i   +*                   172.16.1.2                             0 65002 i   +*>                  172.16.1.1                             0 65001 i   +*> 10.101.0.0/24    172.16.1.1             100              0 65001 i   +*> 10.101.1.0/24    172.16.1.1             100              0 65001 i   +*> 10.101.2.0/24    172.16.1.1             100              0 65001 i   +*> 10.101.3.0/24    172.16.1.1             100              0 65001 i   +*> 10.101.4.0/24    172.16.1.1             100              0 65001 i   +*> 10.101.5.0/24    172.16.1.1             100              0 65001 i   +*> 10.101.6.0/24    172.16.1.1             100              0 65001 i   +*> 10.101.7.0/24    172.16.1.1             100              0 65001 i   +*> 10.101.8.0/24    172.16.1.1             100              0 65001 i   +*> 10.101.9.0/24    172.16.1.1             100              0 65001 i   +*> 10.102.0.0/24    172.16.1.2             100              0 65002 i   +*> 10.102.1.0/24    172.16.1.2             100              0 65002 i   +*> 10.102.2.0/24    172.16.1.2             100              0 65002 i   +*> 10.102.3.0/24    172.16.1.2             100              0 65002 i   +*> 10.102.4.0/24    172.16.1.2             100              0 65002 i   +*> 10.102.5.0/24    172.16.1.2             100              0 65002 i   +*> 10.102.6.0/24    172.16.1.2             100              0 65002 i   +*> 10.102.7.0/24    172.16.1.2             100              0 65002 i   +*> 10.102.8.0/24    172.16.1.2             100              0 65002 i   +*> 10.102.9.0/24    172.16.1.2             100              0 65002 i   +*> 10.105.0.0/24    172.16.1.5             100              0 65005 i   +*> 10.105.1.0/24    172.16.1.5             100              0 65005 i   +*> 10.105.2.0/24    172.16.1.5             100              0 65005 i   +*> 10.105.3.0/24    172.16.1.5             100              0 65005 i   +*> 10.105.4.0/24    172.16.1.5             100              0 65005 i   +*> 10.105.5.0/24    172.16.1.5             100              0 65005 i   +*> 10.105.6.0/24    172.16.1.5             100              0 65005 i   +*> 10.105.7.0/24    172.16.1.5             100              0 65005 i   +*> 10.105.8.0/24    172.16.1.5             100              0 65005 i   +*> 10.105.9.0/24    172.16.1.5             100              0 65005 i   +*> 172.20.0.0/28    0.0.0.0                  0          32768 i assert 1 == 0
E   AssertionError: Routing Table verification failed for router r1, view 1:
      --- actual BGP routing table
      +++ expected BGP routing table
      @@ -1 +1,40 @@
      -Can't find BGP instance 1
      +BGP table version is XXX, local router ID is 172.30.1.1
      +Status codes: s suppressed, d damped, h history, * valid, > best, = multipath,
(39 more lines...)
Collapse Failed test_bgp_multiview_topo1 test_bgp_routingTable History
TopoTest 3.0 Branch < 1 sec
AssertionError: Routing Table verification failed for router r1, view 1:   --- actual BGP routing table   +++ expected BGP routing table   @@ -1 +1,40 @@   -View/Vrf specified is unknown: 1   +BGP table version is XXX, local router ID is 172.30.1.1   +Status codes: s suppressed, d damped, h history, * valid, > best, = multipath,   +              i internal, r RIB-failure, S Stale, R Removed   +Origin codes: i - IGP, e - EGP, ? - incomplete   +   +   Network          Next Hop            Metric LocPrf Weight Path   +*  10.0.1.0/24      172.16.1.5                             0 65005 i   +*                   172.16.1.2                             0 65002 i   +*>                  172.16.1.1                             0 65001 i   +*> 10.101.0.0/24    172.16.1.1             100              0 65001 i   +*> 10.101.1.0/24    172.16.1.1             100              0 65001 i   +*> 10.101.2.0/24    172.16.1.1             100              0 65001 i   +*> 10.101.3.0/24    172.16.1.1             100              0 65001 i   +*> 10.101.4.0/24    172.16.1.1             100              0 65001 i   +*> 10.101.5.0/24    172.16.1.1             100              0 65001 i   +*> 10.101.6.0/24    172.16.1.1             100              0 65001 i   +*> 10.101.7.0/24    172.16.1.1             100              0 65001 i   +*> 10.101.8.0/24    172.16.1.1             100              0 65001 i   +*> 10.101.9.0/24    172.16.1.1             100              0 65001 i   +*> 10.102.0.0/24    172.16.1.2             100              0 65002 i   +*> 10.102.1.0/24    172.16.1.2             100              0 65002 i   +*> 10.102.2.0/24    172.16.1.2             100              0 65002 i   +*> 10.102.3.0/24    172.16.1.2             100              0 65002 i   +*> 10.102.4.0/24    172.16.1.2             100              0 65002 i   +*> 10.102.5.0/24    172.16.1.2             100              0 65002 i   +*> 10.102.6.0/24    172.16.1.2             100              0 65002 i   +*> 10.102.7.0/24    172.16.1.2             100              0 65002 i   +*> 10.102.8.0/24    172.16.1.2             100              0 65002 i   +*> 10.102.9.0/24    172.16.1.2             100              0 65002 i   +*> 10.105.0.0/24    172.16.1.5             100              0 65005 i   +*> 10.105.1.0/24    172.16.1.5             100              0 65005 i   +*> 10.105.2.0/24    172.16.1.5             100              0 65005 i   +*> 10.105.3.0/24    172.16.1.5             100              0 65005 i   +*> 10.105.4.0/24    172.16.1.5             100              0 65005 i   +*> 10.105.5.0/24    172.16.1.5             100              0 65005 i   +*> 10.105.6.0/24    172.16.1.5             100              0 65005 i   +*> 10.105.7.0/24    172.16.1.5             100              0 65005 i   +*> 10.105.8.0/24    172.16.1.5             100              0 65005 i   +*> 10.105.9.0/24    172.16.1.5             100              0 65005 i   +*> 172.20.0.0/28    0.0.0.0                  0          32768 i assert 1 == 0
E   AssertionError: Routing Table verification failed for router r1, view 1:
      --- actual BGP routing table
      +++ expected BGP routing table
      @@ -1 +1,40 @@
      -View/Vrf specified is unknown: 1
      +BGP table version is XXX, local router ID is 172.30.1.1
      +Status codes: s suppressed, d damped, h history, * valid, > best, = multipath,
(39 more lines...)
Collapse Failed test_bgp_multiview_topo1 test_bgp_routingTable History
TopoTest Master amd64 < 1 sec
AssertionError: Routing Table verification failed for router r1, view 1:   --- actual BGP routing table   +++ expected BGP routing table   @@ -1 +1,40 @@   -View/Vrf specified is unknown: 1   +BGP table version is XXX, local router ID is 172.30.1.1   +Status codes: s suppressed, d damped, h history, * valid, > best, = multipath,   +              i internal, r RIB-failure, S Stale, R Removed   +Origin codes: i - IGP, e - EGP, ? - incomplete   +   +   Network          Next Hop            Metric LocPrf Weight Path   +*  10.0.1.0/24      172.16.1.5                             0 65005 i   +*                   172.16.1.2                             0 65002 i   +*>                  172.16.1.1                             0 65001 i   +*> 10.101.0.0/24    172.16.1.1             100              0 65001 i   +*> 10.101.1.0/24    172.16.1.1             100              0 65001 i   +*> 10.101.2.0/24    172.16.1.1             100              0 65001 i   +*> 10.101.3.0/24    172.16.1.1             100              0 65001 i   +*> 10.101.4.0/24    172.16.1.1             100              0 65001 i   +*> 10.101.5.0/24    172.16.1.1             100              0 65001 i   +*> 10.101.6.0/24    172.16.1.1             100              0 65001 i   +*> 10.101.7.0/24    172.16.1.1             100              0 65001 i   +*> 10.101.8.0/24    172.16.1.1             100              0 65001 i   +*> 10.101.9.0/24    172.16.1.1             100              0 65001 i   +*> 10.102.0.0/24    172.16.1.2             100              0 65002 i   +*> 10.102.1.0/24    172.16.1.2             100              0 65002 i   +*> 10.102.2.0/24    172.16.1.2             100              0 65002 i   +*> 10.102.3.0/24    172.16.1.2             100              0 65002 i   +*> 10.102.4.0/24    172.16.1.2             100              0 65002 i   +*> 10.102.5.0/24    172.16.1.2             100              0 65002 i   +*> 10.102.6.0/24    172.16.1.2             100              0 65002 i   +*> 10.102.7.0/24    172.16.1.2             100              0 65002 i   +*> 10.102.8.0/24    172.16.1.2             100              0 65002 i   +*> 10.102.9.0/24    172.16.1.2             100              0 65002 i   +*> 10.105.0.0/24    172.16.1.5             100              0 65005 i   +*> 10.105.1.0/24    172.16.1.5             100              0 65005 i   +*> 10.105.2.0/24    172.16.1.5             100              0 65005 i   +*> 10.105.3.0/24    172.16.1.5             100              0 65005 i   +*> 10.105.4.0/24    172.16.1.5             100              0 65005 i   +*> 10.105.5.0/24    172.16.1.5             100              0 65005 i   +*> 10.105.6.0/24    172.16.1.5             100              0 65005 i   +*> 10.105.7.0/24    172.16.1.5             100              0 65005 i   +*> 10.105.8.0/24    172.16.1.5             100              0 65005 i   +*> 10.105.9.0/24    172.16.1.5             100              0 65005 i   +*> 172.20.0.0/28    0.0.0.0                  0          32768 i assert 1 == 0
E   AssertionError: Routing Table verification failed for router r1, view 1:
      --- actual BGP routing table
      +++ expected BGP routing table
      @@ -1 +1,40 @@
      -View/Vrf specified is unknown: 1
      +BGP table version is XXX, local router ID is 172.30.1.1
      +Status codes: s suppressed, d damped, h history, * valid, > best, = multipath,
(39 more lines...)
Collapse Failed test_ldp_topo1 test_mpls_interfaces History
TopoTest 2.0 Branch < 1 sec
AssertionError: MPLS LDP Interface status failed for router r1:   --- actual MPLS LDP interface status   +++ expected MPLS LDP interface status   @@ -1 +1,2 @@    AF   Interface   State  Uptime   Hello Timers  ac   +ipv4 r1-eth0     ACTIVE xx:xx:xx 5/15           1 assert 1 == 0
E   AssertionError: MPLS LDP Interface status failed for router r1:
      --- actual MPLS LDP interface status
      +++ expected MPLS LDP interface status
      @@ -1 +1,2 @@
       AF   Interface   State  Uptime   Hello Timers  ac
      +ipv4 r1-eth0     ACTIVE xx:xx:xx 5/15           1
    assert 1 == 0
Collapse Failed test_ldp_topo1 test_mpls_interfaces History
TopoTest 3.0 Branch < 1 sec
AssertionError: MPLS LDP Interface status failed for router r1:   --- actual MPLS LDP interface status   +++ expected MPLS LDP interface status   @@ -1 +1,2 @@    AF   Interface   State  Uptime   Hello Timers  ac   +ipv4 r1-eth0     ACTIVE xx:xx:xx 5/15           1 assert 1 == 0
E   AssertionError: MPLS LDP Interface status failed for router r1:
      --- actual MPLS LDP interface status
      +++ expected MPLS LDP interface status
      @@ -1 +1,2 @@
       AF   Interface   State  Uptime   Hello Timers  ac
      +ipv4 r1-eth0     ACTIVE xx:xx:xx 5/15           1
    assert 1 == 0
Collapse Failed test_ldp_topo1 test_mpls_interfaces History
TopoTest Master amd64 < 1 sec
AssertionError: MPLS LDP Interface status failed for router r1:   --- actual MPLS LDP interface status   +++ expected MPLS LDP interface status   @@ -1 +1,2 @@    AF   Interface   State  Uptime   Hello Timers  ac   +ipv4 r1-eth0     ACTIVE xx:xx:xx 5/15           1 assert 1 == 0
E   AssertionError: MPLS LDP Interface status failed for router r1:
      --- actual MPLS LDP interface status
      +++ expected MPLS LDP interface status
      @@ -1 +1,2 @@
       AF   Interface   State  Uptime   Hello Timers  ac
      +ipv4 r1-eth0     ACTIVE xx:xx:xx 5/15           1
    assert 1 == 0
Collapse Failed test_ospf6_topo1 test_ospfv3_routingTable History
TopoTest 2.0 Branch < 1 sec
AssertionError: OSPFv3 (IPv6) Routing Table verification failed for router r1:   --- actual OSPFv3 IPv6 routing table   +++ expected OSPFv3 IPv6 routing table   @@ -1 +1,9 @@   -   +O   fc00:1:1:1::/64 [110/10] is directly connected, r1-stubnet   +O>* fc00:2:2:2::/64 [110/20] via fe80::XXXX:XXXX:XXXX:XXXX, r1-sw5   +O>* fc00:3:3:3::/64 [110/20] via fe80::XXXX:XXXX:XXXX:XXXX, r1-sw5   +O>* fc00:4:4:4::/64 [110/30] via fe80::XXXX:XXXX:XXXX:XXXX, r1-sw5   +O   fc00:a:a:a::/64 [110/10] is directly connected, r1-sw5   +O>* fc00:b:b:b::/64 [110/20] via fe80::XXXX:XXXX:XXXX:XXXX, r1-sw5   +O>* fc00:2222:2222:2222::/64 [110/10] via fe80::XXXX:XXXX:XXXX:XXXX, r1-sw5   +O>* fc00:3333:3333:3333::/64 [110/10] via fe80::XXXX:XXXX:XXXX:XXXX, r1-sw5   +O>* fc00:4444:4444:4444::/64 [110/20] via fe80::XXXX:XXXX:XXXX:XXXX, r1-sw5 assert 1 == 0
E   AssertionError: OSPFv3 (IPv6) Routing Table verification failed for router r1:
      --- actual OSPFv3 IPv6 routing table
      +++ expected OSPFv3 IPv6 routing table
      @@ -1 +1,9 @@
      -
      +O   fc00:1:1:1::/64 [110/10] is directly connected, r1-stubnet
      +O>* fc00:2:2:2::/64 [110/20] via fe80::XXXX:XXXX:XXXX:XXXX, r1-sw5
(8 more lines...)
Collapse Failed test_ospf6_topo1 test_linux_ipv6_kernel_routingTable History
TopoTest 2.0 Branch < 1 sec
AssertionError: Linux Kernel IPv6 Routing Table verification failed for router r1:   --- actual OSPFv3 IPv6 routing table   +++ expected OSPFv3 IPv6 routing table   @@ -1,3 +1,13 @@   +fc00:1:1:1::/64 dev r1-stubnet  proto XXXX  metric 256  pref medium   +fc00:2:2:2::/64 via fe80::__(r2-sw5)__ dev r1-sw5  proto XXXX  metric 20  pref medium   +fc00:3:3:3::/64 via fe80::__(r3-sw5)__ dev r1-sw5  proto XXXX  metric 20  pref medium   +fc00:4:4:4::/64 via fe80::__(r3-sw5)__ dev r1-sw5  proto XXXX  metric 20  pref medium   +fc00:a:a:a::/64 dev r1-sw5  proto XXXX  metric 256  pref medium   +fc00:b:b:b::/64 via fe80::__(r3-sw5)__ dev r1-sw5  proto XXXX  metric 20  pref medium   +fc00:1111:1111:1111::/64 via fc00:1:1:1::1234 dev r1-stubnet  proto XXXX  metric 20  pref medium   +fc00:2222:2222:2222::/64 via fe80::__(r2-sw5)__ dev r1-sw5  proto XXXX  metric 20  pref medium   +fc00:3333:3333:3333::/64 via fe80::__(r3-sw5)__ dev r1-sw5  proto XXXX  metric 20  pref medium   +fc00:4444:4444:4444::/64 via fe80::__(r3-sw5)__ dev r1-sw5  proto XXXX  metric 20  pref medium    unreachable fe80::/64 dev lo  proto XXXX  metric 256  error -101 pref medium    fe80::/64 dev r1-stubnet  proto XXXX  metric 256  pref medium    fe80::/64 dev r1-sw5  proto XXXX  metric 256  pref medium assert 1 == 0
E   AssertionError: Linux Kernel IPv6 Routing Table verification failed for router r1:
      --- actual OSPFv3 IPv6 routing table
      +++ expected OSPFv3 IPv6 routing table
      @@ -1,3 +1,13 @@
      +fc00:1:1:1::/64 dev r1-stubnet  proto XXXX  metric 256  pref medium
      +fc00:2:2:2::/64 via fe80::__(r2-sw5)__ dev r1-sw5  proto XXXX  metric 20  pref medium
      +fc00:3:3:3::/64 via fe80::__(r3-sw5)__ dev r1-sw5  proto XXXX  metric 20  pref medium
(11 more lines...)
Collapse Failed test_ospf6_topo1 test_linux_ipv6_kernel_routingTable History
TopoTest 3.0 Branch < 1 sec
AssertionError: Linux Kernel IPv6 Routing Table verification failed for router r1:   --- actual OSPFv3 IPv6 routing table   +++ expected OSPFv3 IPv6 routing table   @@ -1,3 +1,13 @@   +fc00:1:1:1::/64 dev r1-stubnet  proto XXXX  metric 256  pref medium   +fc00:2:2:2::/64 via fe80::__(r2-sw5)__ dev r1-sw5  proto XXXX  metric 20  pref medium   +fc00:3:3:3::/64 via fe80::__(r3-sw5)__ dev r1-sw5  proto XXXX  metric 20  pref medium   +fc00:4:4:4::/64 via fe80::__(r3-sw5)__ dev r1-sw5  proto XXXX  metric 20  pref medium   +fc00:a:a:a::/64 dev r1-sw5  proto XXXX  metric 256  pref medium   +fc00:b:b:b::/64 via fe80::__(r3-sw5)__ dev r1-sw5  proto XXXX  metric 20  pref medium   +fc00:1111:1111:1111::/64 via fc00:1:1:1::1234 dev r1-stubnet  proto XXXX  metric 20  pref medium   +fc00:2222:2222:2222::/64 via fe80::__(r2-sw5)__ dev r1-sw5  proto XXXX  metric 20  pref medium   +fc00:3333:3333:3333::/64 via fe80::__(r3-sw5)__ dev r1-sw5  proto XXXX  metric 20  pref medium   +fc00:4444:4444:4444::/64 via fe80::__(r3-sw5)__ dev r1-sw5  proto XXXX  metric 20  pref medium    unreachable fe80::/64 dev lo  proto XXXX  metric 256  error -101 pref medium    fe80::/64 dev r1-stubnet  proto XXXX  metric 256  pref medium    fe80::/64 dev r1-sw5  proto XXXX  metric 256  pref medium assert 1 == 0
E   AssertionError: Linux Kernel IPv6 Routing Table verification failed for router r1:
      --- actual OSPFv3 IPv6 routing table
      +++ expected OSPFv3 IPv6 routing table
      @@ -1,3 +1,13 @@
      +fc00:1:1:1::/64 dev r1-stubnet  proto XXXX  metric 256  pref medium
      +fc00:2:2:2::/64 via fe80::__(r2-sw5)__ dev r1-sw5  proto XXXX  metric 20  pref medium
      +fc00:3:3:3::/64 via fe80::__(r3-sw5)__ dev r1-sw5  proto XXXX  metric 20  pref medium
(11 more lines...)
Collapse Failed test_ospf6_topo1 test_ospfv3_routingTable History
TopoTest 3.0 Branch < 1 sec
AssertionError: OSPFv3 (IPv6) Routing Table verification failed for router r1:   --- actual OSPFv3 IPv6 routing table   +++ expected OSPFv3 IPv6 routing table   @@ -1 +1,9 @@   -   +O   fc00:1:1:1::/64 [110/10] is directly connected, r1-stubnet   +O>* fc00:2:2:2::/64 [110/20] via fe80::XXXX:XXXX:XXXX:XXXX, r1-sw5   +O>* fc00:3:3:3::/64 [110/20] via fe80::XXXX:XXXX:XXXX:XXXX, r1-sw5   +O>* fc00:4:4:4::/64 [110/30] via fe80::XXXX:XXXX:XXXX:XXXX, r1-sw5   +O   fc00:a:a:a::/64 [110/10] is directly connected, r1-sw5   +O>* fc00:b:b:b::/64 [110/20] via fe80::XXXX:XXXX:XXXX:XXXX, r1-sw5   +O>* fc00:2222:2222:2222::/64 [110/10] via fe80::XXXX:XXXX:XXXX:XXXX, r1-sw5   +O>* fc00:3333:3333:3333::/64 [110/10] via fe80::XXXX:XXXX:XXXX:XXXX, r1-sw5   +O>* fc00:4444:4444:4444::/64 [110/20] via fe80::XXXX:XXXX:XXXX:XXXX, r1-sw5 assert 1 == 0
E   AssertionError: OSPFv3 (IPv6) Routing Table verification failed for router r1:
      --- actual OSPFv3 IPv6 routing table
      +++ expected OSPFv3 IPv6 routing table
      @@ -1 +1,9 @@
      -
      +O   fc00:1:1:1::/64 [110/10] is directly connected, r1-stubnet
      +O>* fc00:2:2:2::/64 [110/20] via fe80::XXXX:XXXX:XXXX:XXXX, r1-sw5
(8 more lines...)
Collapse Failed test_ospf6_topo1 test_linux_ipv6_kernel_routingTable History
TopoTest Master amd64 < 1 sec
AssertionError: Linux Kernel IPv6 Routing Table verification failed for router r1:   --- actual OSPFv3 IPv6 routing table   +++ expected OSPFv3 IPv6 routing table   @@ -1,3 +1,13 @@   +fc00:1:1:1::/64 dev r1-stubnet  proto XXXX  metric 256  pref medium   +fc00:2:2:2::/64 via fe80::__(r2-sw5)__ dev r1-sw5  proto XXXX  metric 20  pref medium   +fc00:3:3:3::/64 via fe80::__(r3-sw5)__ dev r1-sw5  proto XXXX  metric 20  pref medium   +fc00:4:4:4::/64 via fe80::__(r3-sw5)__ dev r1-sw5  proto XXXX  metric 20  pref medium   +fc00:a:a:a::/64 dev r1-sw5  proto XXXX  metric 256  pref medium   +fc00:b:b:b::/64 via fe80::__(r3-sw5)__ dev r1-sw5  proto XXXX  metric 20  pref medium   +fc00:1111:1111:1111::/64 via fc00:1:1:1::1234 dev r1-stubnet  proto XXXX  metric 20  pref medium   +fc00:2222:2222:2222::/64 via fe80::__(r2-sw5)__ dev r1-sw5  proto XXXX  metric 20  pref medium   +fc00:3333:3333:3333::/64 via fe80::__(r3-sw5)__ dev r1-sw5  proto XXXX  metric 20  pref medium   +fc00:4444:4444:4444::/64 via fe80::__(r3-sw5)__ dev r1-sw5  proto XXXX  metric 20  pref medium    unreachable fe80::/64 dev lo  proto XXXX  metric 256  error -101 pref medium    fe80::/64 dev r1-stubnet  proto XXXX  metric 256  pref medium    fe80::/64 dev r1-sw5  proto XXXX  metric 256  pref medium assert 1 == 0
E   AssertionError: Linux Kernel IPv6 Routing Table verification failed for router r1:
      --- actual OSPFv3 IPv6 routing table
      +++ expected OSPFv3 IPv6 routing table
      @@ -1,3 +1,13 @@
      +fc00:1:1:1::/64 dev r1-stubnet  proto XXXX  metric 256  pref medium
      +fc00:2:2:2::/64 via fe80::__(r2-sw5)__ dev r1-sw5  proto XXXX  metric 20  pref medium
      +fc00:3:3:3::/64 via fe80::__(r3-sw5)__ dev r1-sw5  proto XXXX  metric 20  pref medium
(11 more lines...)
Collapse Failed test_ospf6_topo1 test_ospfv3_routingTable History
TopoTest Master amd64 < 1 sec
AssertionError: OSPFv3 (IPv6) Routing Table verification failed for router r1:   --- actual OSPFv3 IPv6 routing table   +++ expected OSPFv3 IPv6 routing table   @@ -1 +1,9 @@   -   +O   fc00:1:1:1::/64 [110/10] is directly connected, r1-stubnet   +O>* fc00:2:2:2::/64 [110/20] via fe80::XXXX:XXXX:XXXX:XXXX, r1-sw5   +O>* fc00:3:3:3::/64 [110/20] via fe80::XXXX:XXXX:XXXX:XXXX, r1-sw5   +O>* fc00:4:4:4::/64 [110/30] via fe80::XXXX:XXXX:XXXX:XXXX, r1-sw5   +O   fc00:a:a:a::/64 [110/10] is directly connected, r1-sw5   +O>* fc00:b:b:b::/64 [110/20] via fe80::XXXX:XXXX:XXXX:XXXX, r1-sw5   +O>* fc00:2222:2222:2222::/64 [110/10] via fe80::XXXX:XXXX:XXXX:XXXX, r1-sw5   +O>* fc00:3333:3333:3333::/64 [110/10] via fe80::XXXX:XXXX:XXXX:XXXX, r1-sw5   +O>* fc00:4444:4444:4444::/64 [110/20] via fe80::XXXX:XXXX:XXXX:XXXX, r1-sw5 assert 1 == 0
E   AssertionError: OSPFv3 (IPv6) Routing Table verification failed for router r1:
      --- actual OSPFv3 IPv6 routing table
      +++ expected OSPFv3 IPv6 routing table
      @@ -1 +1,9 @@
      -
      +O   fc00:1:1:1::/64 [110/10] is directly connected, r1-stubnet
      +O>* fc00:2:2:2::/64 [110/20] via fe80::XXXX:XXXX:XXXX:XXXX, r1-sw5
(8 more lines...)
Collapse Failed test_ripng_topo1 test_ripng_routes History
TopoTest 2.0 Branch < 1 sec
AssertionError: SHOW IPv6 RIPng failed for router r1:   --- actual SHOW IPv6 RIPng   +++ expected SHOW IPv6 RIPng   @@ -1 +1,14 @@   +Codes: R - RIPng, C - connected, S - Static, O - OSPF, B - BGP   +Sub-codes:   +      (n) - normal, (s) - static, (d) - default, (r) - redistribute,   +      (i) - interface, (a/S) - aggregated/Suppressed       +   Network      Next Hop                      Via     Metric Tag Time   +C(i) fc00:5::/64   +                  ::                          self       1    0   +R(n) fc00:6::/62   +                  fe80::XXXX:XXXX:XXXX:XXXX   r1-eth1    2    0  XX:XX   +R(n) fc00:7::/64   +                  fe80::XXXX:XXXX:XXXX:XXXX   r1-eth1    3    0  XX:XX   +R(n) fc00:7:1111::/64   +                  fe80::XXXX:XXXX:XXXX:XXXX   r1-eth1    3    0  XX:XX assert 1 == 0
E   AssertionError: SHOW IPv6 RIPng failed for router r1:
      --- actual SHOW IPv6 RIPng
      +++ expected SHOW IPv6 RIPng
      @@ -1 +1,14 @@
      +Codes: R - RIPng, C - connected, S - Static, O - OSPF, B - BGP
      +Sub-codes:
      +      (n) - normal, (s) - static, (d) - default, (r) - redistribute,
(12 more lines...)
Collapse Failed test_ripng_topo1 test_zebra_ipv6_routingTable History
TopoTest 2.0 Branch < 1 sec
AssertionError: Zebra IPv6 Routing Table verification failed for router r1:   --- actual Zebra IPv6 routing table   +++ expected Zebra IPv6 routing table   @@ -1 +1,3 @@   -   +R>* fc00:6::/62 [120/2] via fe80::XXXX:XXXX:XXXX:XXXX, r1-eth1   +R>* fc00:7::/64 [120/3] via fe80::XXXX:XXXX:XXXX:XXXX, r1-eth1   +R>* fc00:7:1111::/64 [120/3] via fe80::XXXX:XXXX:XXXX:XXXX, r1-eth1 assert 1 == 0
E   AssertionError: Zebra IPv6 Routing Table verification failed for router r1:
      --- actual Zebra IPv6 routing table
      +++ expected Zebra IPv6 routing table
      @@ -1 +1,3 @@
      -
      +R>* fc00:6::/62 [120/2] via fe80::XXXX:XXXX:XXXX:XXXX, r1-eth1
      +R>* fc00:7::/64 [120/3] via fe80::XXXX:XXXX:XXXX:XXXX, r1-eth1
(2 more lines...)
Collapse Failed test_ripng_topo1 test_ripng_status History
TopoTest 2.0 Branch < 1 sec
AssertionError: IPv6 RIPng status failed for router r1:   --- actual IPv6 RIPng status   +++ expected IPv6 RIPng status   @@ -1 +1,16 @@   -   +Routing Protocol is "RIPng"   +  Sending updates every 30 seconds with +/-50%, next due in XX seconds   +  Timeout after 180 seconds, garbage collect after 120 seconds   +  Outgoing update filter list for all interface is not set   +  Incoming update filter list for all interface is not set   +  Default redistribution metric is 1   +  Redistributing:   +  Default version control: send version 1, receive version 1    +    Interface        Send  Recv   +    r1-eth1          1     1     +  Routing for Networks:   +    fc00:5::/64   +  Routing Information Sources:   +    Gateway          BadPackets BadRoutes  Distance Last Update   +    fe80::XXXX:XXXX:XXXX:XXXX    +                        0          0        120      XX:XX:XX assert 1 == 0
E   AssertionError: IPv6 RIPng status failed for router r1:
      --- actual IPv6 RIPng status
      +++ expected IPv6 RIPng status
      @@ -1 +1,16 @@
      -
      +Routing Protocol is "RIPng"
      +  Sending updates every 30 seconds with +/-50%, next due in XX seconds
(15 more lines...)
Collapse Failed test_ripng_topo1 test_zebra_ipv6_routingTable History
TopoTest 3.0 Branch < 1 sec
AssertionError: Zebra IPv6 Routing Table verification failed for router r1:   --- actual Zebra IPv6 routing table   +++ expected Zebra IPv6 routing table   @@ -1 +1,3 @@   -   +R>* fc00:6::/62 [120/2] via fe80::XXXX:XXXX:XXXX:XXXX, r1-eth1   +R>* fc00:7::/64 [120/3] via fe80::XXXX:XXXX:XXXX:XXXX, r1-eth1   +R>* fc00:7:1111::/64 [120/3] via fe80::XXXX:XXXX:XXXX:XXXX, r1-eth1 assert 1 == 0
E   AssertionError: Zebra IPv6 Routing Table verification failed for router r1:
      --- actual Zebra IPv6 routing table
      +++ expected Zebra IPv6 routing table
      @@ -1 +1,3 @@
      -
      +R>* fc00:6::/62 [120/2] via fe80::XXXX:XXXX:XXXX:XXXX, r1-eth1
      +R>* fc00:7::/64 [120/3] via fe80::XXXX:XXXX:XXXX:XXXX, r1-eth1
(2 more lines...)
Collapse Failed test_ripng_topo1 test_ripng_routes History
TopoTest 3.0 Branch < 1 sec
AssertionError: SHOW IPv6 RIPng failed for router r1:   --- actual SHOW IPv6 RIPng   +++ expected SHOW IPv6 RIPng   @@ -1 +1,14 @@   +Codes: R - RIPng, C - connected, S - Static, O - OSPF, B - BGP   +Sub-codes:   +      (n) - normal, (s) - static, (d) - default, (r) - redistribute,   +      (i) - interface, (a/S) - aggregated/Suppressed       +   Network      Next Hop                      Via     Metric Tag Time   +C(i) fc00:5::/64   +                  ::                          self       1    0   +R(n) fc00:6::/62   +                  fe80::XXXX:XXXX:XXXX:XXXX   r1-eth1    2    0  XX:XX   +R(n) fc00:7::/64   +                  fe80::XXXX:XXXX:XXXX:XXXX   r1-eth1    3    0  XX:XX   +R(n) fc00:7:1111::/64   +                  fe80::XXXX:XXXX:XXXX:XXXX   r1-eth1    3    0  XX:XX assert 1 == 0
E   AssertionError: SHOW IPv6 RIPng failed for router r1:
      --- actual SHOW IPv6 RIPng
      +++ expected SHOW IPv6 RIPng
      @@ -1 +1,14 @@
      +Codes: R - RIPng, C - connected, S - Static, O - OSPF, B - BGP
      +Sub-codes:
      +      (n) - normal, (s) - static, (d) - default, (r) - redistribute,
(12 more lines...)
Collapse Failed test_ripng_topo1 test_ripng_status History
TopoTest 3.0 Branch < 1 sec
AssertionError: IPv6 RIPng status failed for router r1:   --- actual IPv6 RIPng status   +++ expected IPv6 RIPng status   @@ -1 +1,16 @@   -   +Routing Protocol is "RIPng"   +  Sending updates every 30 seconds with +/-50%, next due in XX seconds   +  Timeout after 180 seconds, garbage collect after 120 seconds   +  Outgoing update filter list for all interface is not set   +  Incoming update filter list for all interface is not set   +  Default redistribution metric is 1   +  Redistributing:   +  Default version control: send version 1, receive version 1    +    Interface        Send  Recv   +    r1-eth1          1     1     +  Routing for Networks:   +    fc00:5::/64   +  Routing Information Sources:   +    Gateway          BadPackets BadRoutes  Distance Last Update   +    fe80::XXXX:XXXX:XXXX:XXXX    +                        0          0        120      XX:XX:XX assert 1 == 0
E   AssertionError: IPv6 RIPng status failed for router r1:
      --- actual IPv6 RIPng status
      +++ expected IPv6 RIPng status
      @@ -1 +1,16 @@
      -
      +Routing Protocol is "RIPng"
      +  Sending updates every 30 seconds with +/-50%, next due in XX seconds
(15 more lines...)
Collapse Failed test_ripng_topo1 test_zebra_ipv6_routingTable History
TopoTest Master amd64 < 1 sec
AssertionError: Zebra IPv6 Routing Table verification failed for router r1:   --- actual Zebra IPv6 routing table   +++ expected Zebra IPv6 routing table   @@ -1 +1,3 @@   -   +R>* fc00:6::/62 [120/2] via fe80::XXXX:XXXX:XXXX:XXXX, r1-eth1   +R>* fc00:7::/64 [120/3] via fe80::XXXX:XXXX:XXXX:XXXX, r1-eth1   +R>* fc00:7:1111::/64 [120/3] via fe80::XXXX:XXXX:XXXX:XXXX, r1-eth1 assert 1 == 0
E   AssertionError: Zebra IPv6 Routing Table verification failed for router r1:
      --- actual Zebra IPv6 routing table
      +++ expected Zebra IPv6 routing table
      @@ -1 +1,3 @@
      -
      +R>* fc00:6::/62 [120/2] via fe80::XXXX:XXXX:XXXX:XXXX, r1-eth1
      +R>* fc00:7::/64 [120/3] via fe80::XXXX:XXXX:XXXX:XXXX, r1-eth1
(2 more lines...)
Collapse Failed test_ripng_topo1 test_ripng_routes History
TopoTest Master amd64 < 1 sec
AssertionError: SHOW IPv6 RIPng failed for router r1:   --- actual SHOW IPv6 RIPng   +++ expected SHOW IPv6 RIPng   @@ -1 +1,14 @@   +Codes: R - RIPng, C - connected, S - Static, O - OSPF, B - BGP   +Sub-codes:   +      (n) - normal, (s) - static, (d) - default, (r) - redistribute,   +      (i) - interface, (a/S) - aggregated/Suppressed       +   Network      Next Hop                      Via     Metric Tag Time   +C(i) fc00:5::/64   +                  ::                          self       1    0   +R(n) fc00:6::/62   +                  fe80::XXXX:XXXX:XXXX:XXXX   r1-eth1    2    0  XX:XX   +R(n) fc00:7::/64   +                  fe80::XXXX:XXXX:XXXX:XXXX   r1-eth1    3    0  XX:XX   +R(n) fc00:7:1111::/64   +                  fe80::XXXX:XXXX:XXXX:XXXX   r1-eth1    3    0  XX:XX assert 1 == 0
E   AssertionError: SHOW IPv6 RIPng failed for router r1:
      --- actual SHOW IPv6 RIPng
      +++ expected SHOW IPv6 RIPng
      @@ -1 +1,14 @@
      +Codes: R - RIPng, C - connected, S - Static, O - OSPF, B - BGP
      +Sub-codes:
      +      (n) - normal, (s) - static, (d) - default, (r) - redistribute,
(12 more lines...)
Collapse Failed test_ripng_topo1 test_ripng_status History
TopoTest Master amd64 < 1 sec
AssertionError: IPv6 RIPng status failed for router r1:   --- actual IPv6 RIPng status   +++ expected IPv6 RIPng status   @@ -1 +1,16 @@   -   +Routing Protocol is "RIPng"   +  Sending updates every 30 seconds with +/-50%, next due in XX seconds   +  Timeout after 180 seconds, garbage collect after 120 seconds   +  Outgoing update filter list for all interface is not set   +  Incoming update filter list for all interface is not set   +  Default redistribution metric is 1   +  Redistributing:   +  Default version control: send version 1, receive version 1    +    Interface        Send  Recv   +    r1-eth1          1     1     +  Routing for Networks:   +    fc00:5::/64   +  Routing Information Sources:   +    Gateway          BadPackets BadRoutes  Distance Last Update   +    fe80::XXXX:XXXX:XXXX:XXXX    +                        0          0        120      XX:XX:XX assert 1 == 0
E   AssertionError: IPv6 RIPng status failed for router r1:
      --- actual IPv6 RIPng status
      +++ expected IPv6 RIPng status
      @@ -1 +1,16 @@
      -
      +Routing Protocol is "RIPng"
      +  Sending updates every 30 seconds with +/-50%, next due in XX seconds
(15 more lines...)
Collapse Failed test_rip_topo1 test_rip_routes History
TopoTest 2.0 Branch < 1 sec
AssertionError: SHOW IP RIP failed for router r1:   --- actual SHOW IP RIP   +++ expected SHOW IP RIP   @@ -1 +1,10 @@   +Codes: R - RIP, C - connected, S - Static, O - OSPF, B - BGP   +Sub-codes:   +      (n) - normal, (s) - static, (d) - default, (r) - redistribute,   +      (i) - interface       +     Network            Next Hop         Metric From            Tag Time   +R(n) 192.168.2.0/24     193.1.1.2             3 193.1.1.2         0 XX:XX   +R(n) 192.168.3.0/24     193.1.1.2             3 193.1.1.2         0 XX:XX   +C(i) 193.1.1.0/26       0.0.0.0               1 self              0   +R(n) 193.1.2.0/24       193.1.1.2             2 193.1.1.2         0 XX:XX assert 1 == 0
E   AssertionError: SHOW IP RIP failed for router r1:
      --- actual SHOW IP RIP
      +++ expected SHOW IP RIP
      @@ -1 +1,10 @@
      +Codes: R - RIP, C - connected, S - Static, O - OSPF, B - BGP
      +Sub-codes:
      +      (n) - normal, (s) - static, (d) - default, (r) - redistribute,
(8 more lines...)
Collapse Failed test_rip_topo1 test_rip_status History
TopoTest 2.0 Branch < 1 sec
AssertionError: IP RIP status failed for router r1:   --- actual IP RIP status   +++ expected IP RIP status   @@ -1 +1,16 @@   -   +Routing Protocol is "rip"   +  Sending updates every 30 seconds with +/-50%, next due in XX seconds   +  Timeout after 180 seconds, garbage collect after 120 seconds   +  Outgoing update filter list for all interface is not set   +  Incoming update filter list for all interface is not set   +  Default redistribution metric is 1   +  Redistributing:   +  Default version control: send version 2, receive version 2    +    Interface        Send  Recv   Key-chain   +    r1-eth1          2     2         +  Routing for Networks:   +    193.1.1.0/26   +  Routing Information Sources:   +    Gateway          BadPackets BadRoutes  Distance Last Update   +    193.1.1.2                0         0       120   XX:XX:XX   +  Distance: (default is 120) assert 1 == 0
E   AssertionError: IP RIP status failed for router r1:
      --- actual IP RIP status
      +++ expected IP RIP status
      @@ -1 +1,16 @@
      -
      +Routing Protocol is "rip"
      +  Sending updates every 30 seconds with +/-50%, next due in XX seconds
(15 more lines...)
Collapse Failed test_rip_topo1 test_zebra_ipv4_routingTable History
TopoTest 2.0 Branch < 1 sec
AssertionError: Zebra IPv4 Routing Table verification failed for router r1:   --- actual Zebra IPv4 routing table   +++ expected Zebra IPv4 routing table   @@ -1 +1,3 @@   -   +R>* 192.168.2.0/24 [120/3] via 193.1.1.2, r1-eth1   +R>* 192.168.3.0/24 [120/3] via 193.1.1.2, r1-eth1   +R>* 193.1.2.0/24 [120/2] via 193.1.1.2, r1-eth1 assert 1 == 0
E   AssertionError: Zebra IPv4 Routing Table verification failed for router r1:
      --- actual Zebra IPv4 routing table
      +++ expected Zebra IPv4 routing table
      @@ -1 +1,3 @@
      -
      +R>* 192.168.2.0/24 [120/3] via 193.1.1.2, r1-eth1
      +R>* 192.168.3.0/24 [120/3] via 193.1.1.2, r1-eth1
(2 more lines...)
Collapse Failed test_rip_topo1 test_zebra_ipv4_routingTable History
TopoTest 3.0 Branch < 1 sec
AssertionError: Zebra IPv4 Routing Table verification failed for router r1:   --- actual Zebra IPv4 routing table   +++ expected Zebra IPv4 routing table   @@ -1 +1,3 @@   -   +R>* 192.168.2.0/24 [120/3] via 193.1.1.2, r1-eth1   +R>* 192.168.3.0/24 [120/3] via 193.1.1.2, r1-eth1   +R>* 193.1.2.0/24 [120/2] via 193.1.1.2, r1-eth1 assert 1 == 0
E   AssertionError: Zebra IPv4 Routing Table verification failed for router r1:
      --- actual Zebra IPv4 routing table
      +++ expected Zebra IPv4 routing table
      @@ -1 +1,3 @@
      -
      +R>* 192.168.2.0/24 [120/3] via 193.1.1.2, r1-eth1
      +R>* 192.168.3.0/24 [120/3] via 193.1.1.2, r1-eth1
(2 more lines...)
Collapse Failed test_rip_topo1 test_rip_status History
TopoTest 3.0 Branch < 1 sec
AssertionError: IP RIP status failed for router r1:   --- actual IP RIP status   +++ expected IP RIP status   @@ -1 +1,16 @@   -   +Routing Protocol is "rip"   +  Sending updates every 30 seconds with +/-50%, next due in XX seconds   +  Timeout after 180 seconds, garbage collect after 120 seconds   +  Outgoing update filter list for all interface is not set   +  Incoming update filter list for all interface is not set   +  Default redistribution metric is 1   +  Redistributing:   +  Default version control: send version 2, receive version 2    +    Interface        Send  Recv   Key-chain   +    r1-eth1          2     2         +  Routing for Networks:   +    193.1.1.0/26   +  Routing Information Sources:   +    Gateway          BadPackets BadRoutes  Distance Last Update   +    193.1.1.2                0         0       120   XX:XX:XX   +  Distance: (default is 120) assert 1 == 0
E   AssertionError: IP RIP status failed for router r1:
      --- actual IP RIP status
      +++ expected IP RIP status
      @@ -1 +1,16 @@
      -
      +Routing Protocol is "rip"
      +  Sending updates every 30 seconds with +/-50%, next due in XX seconds
(15 more lines...)

Shared artifacts

Artifact File size
VersionInfo 766 bytes
SourceCode 3 MB
topotests 385 KB