Testing PullReq against Topology Tests

Build: #234 failed Custom build by Github Hook with revision master

Build result summary

Details

Completed
Duration
26 minutes
Flags
Custom revisionCustom build
Labels
version=frr-5_1-dev-184-g51f9d3e70git=https_//github_com/frrouting/topotests_gitbuildurl=https_//ci1_netdef_org/browse/frr-topopr-cf-234branch=master
Revisions
FRR - Topotests
master master
FRR - FreeRangeRouting
51f9d3e70ffa6e27fdb51ecc10b618091d518c28 51f9d3e70ffa6e27fdb51ecc10b618091d518c28
Total tests
776
Fixed in
#235 (Custom build by Github Hook with revision master)

Tests

Custom variables

Custom revision
master master
Name Value
github_base_sha b61406d97af26a969a7035bca34b49903f7b9966
github_pullreq 94
github_branch master
github_repo FRRouting/topotests
github_merge_sha 2b6d1994135ff4cdbb3282300afd2e985fe5ffd0

Comments

  1. Github Hook

    GitHub Merge Request 94
    for GitHub Repo FRRouting/topotests, branch master

    Request to merge from donaldsharp/topotests
    Merge Git Commit ID 2b6d1994135ff4cdbb3282300afd2e985fe5ffd0 on top of base Git Commit ID b61406d97af26a969a7035bca34b49903f7b9966

Code commits

FRR - Topotests
Author Commit Message Commit date
Martin Winter Martin Winter b61406d97af26a969a7035bca34b49903f7b9966 b61406d97af26a969a7035bca34b49903f7b9966 Merge pull request #91 from LabNConsulting/working/dir-per-node
Use directory per node, report cores stacks  and memory on exit
FRR - FreeRangeRouting
Author Commit Message Commit date
Donald Sharp Donald Sharp 51f9d3e70ffa6e27fdb51ecc10b618091d518c28 51f9d3e70ffa6e27fdb51ecc10b618091d518c28 Merge pull request #2034 from vincentbernat/fix/rfc8365-auto-rt
bgpd: add an option for RT auto-derivation to use RFC 8635.
Martin Winter Martin Winter c7e35331e3f73d2c7620427f928aa85aa80978ab c7e35331e3f73d2c7620427f928aa85aa80978ab Merge pull request #2240 from donaldsharp/ubuntu_bull
Ubuntu 18.04 fixes
Russ White <russ@riw.us> Russ White <russ@riw.us> 5d5f37c40065eaf9c949582674c1728b93b57bab 5d5f37c40065eaf9c949582674c1728b93b57bab Merge pull request #2226 from ppmathis/feature/bgp-lc-json
bgpd: Improve JSON support for large communities
Quentin Young Quentin Young f1351900861ff56b6f2885b8d515ecd4bb2f3f55 f1351900861ff56b6f2885b8d515ecd4bb2f3f55 Merge pull request #2241 from brotherdust/docdev-ubuntu-1804-build-guide
docdev: Ubuntu 1804 build guide

Tests

New test failures 195
Status Test View job Duration
Collapse Failed test_all_protocol_startup test_isis_interfaces History
TopoTest Master arm7 < 1 sec
test setup failure
E   AssertionError
Collapse Failed test_all_protocol_startup test_converge_protocols History
TopoTest Master arm7 < 1 sec
test setup failure
E   AssertionError
Collapse Failed test_all_protocol_startup test_rip_status History
TopoTest Master arm7 < 1 sec
test setup failure
E   AssertionError
Collapse Failed test_all_protocol_startup test_router_running History
TopoTest Master arm7 3 secs
test setup failure
E   AssertionError
Collapse Failed test_all_protocol_startup test_ripng_status History
TopoTest Master arm7 < 1 sec
test setup failure
E   AssertionError
Collapse Failed test_all_protocol_startup test_error_messages_daemons History
TopoTest Master arm7 < 1 sec
test setup failure
E   AssertionError
Collapse Failed test_all_protocol_startup test_bgp_ipv6 History
TopoTest Master arm7 < 1 sec
test setup failure
E   AssertionError
Collapse Failed test_all_protocol_startup test_bgp_ipv4 History
TopoTest Master arm7 < 1 sec
test setup failure
E   AssertionError
Collapse Failed test_all_protocol_startup test_error_messages_vtysh History
TopoTest Master arm7 < 1 sec
test setup failure
E   AssertionError
Collapse Failed test_all_protocol_startup test_shutdown_check_memleak History
TopoTest Master arm7 < 1 sec
test setup failure
E   AssertionError
Collapse Failed test_all_protocol_startup test_bgp_summary History
TopoTest Master arm7 < 1 sec
test setup failure
E   AssertionError
Collapse Failed test_all_protocol_startup test_ospfv2_interfaces History
TopoTest Master arm7 < 1 sec
test setup failure
E   AssertionError
Collapse Failed test_all_protocol_startup test_mpls_interfaces History
TopoTest Master arm7 < 1 sec
test setup failure
E   AssertionError
Collapse Failed test_all_protocol_startup test_bgp_ipv6_summary History
TopoTest Master arm7 < 1 sec
test setup failure
E   AssertionError
Collapse Failed test_all_protocol_startup test_shutdown_check_stderr History
TopoTest Master arm7 < 1 sec
test setup failure
E   AssertionError
Collapse Failed test_all_protocol_startup test_bgp_ipv4 History
TopoTest Master arm8 < 1 sec
test setup failure
E   AssertionError
Collapse Failed test_all_protocol_startup test_shutdown_check_memleak History
TopoTest Master arm8 < 1 sec
test setup failure
E   AssertionError
Collapse Failed test_all_protocol_startup test_bgp_ipv6 History
TopoTest Master arm8 < 1 sec
test setup failure
E   AssertionError
Collapse Failed test_all_protocol_startup test_error_messages_daemons History
TopoTest Master arm8 < 1 sec
test setup failure
E   AssertionError
Collapse Failed test_all_protocol_startup test_shutdown_check_stderr History
TopoTest Master arm8 < 1 sec
test setup failure
E   AssertionError
Collapse Failed test_all_protocol_startup test_ospfv2_interfaces History
TopoTest Master arm8 < 1 sec
test setup failure
E   AssertionError
Collapse Failed test_all_protocol_startup test_mpls_interfaces History
TopoTest Master arm8 < 1 sec
test setup failure
E   AssertionError
Collapse Failed test_all_protocol_startup test_rip_status History
TopoTest Master arm8 < 1 sec
test setup failure
E   AssertionError
Collapse Failed test_all_protocol_startup test_converge_protocols History
TopoTest Master arm8 < 1 sec
test setup failure
E   AssertionError
Collapse Failed test_all_protocol_startup test_error_messages_vtysh History
TopoTest Master arm8 < 1 sec
test setup failure
E   AssertionError
Collapse Failed test_all_protocol_startup test_bgp_summary History
TopoTest Master arm8 < 1 sec
test setup failure
E   AssertionError
Collapse Failed test_all_protocol_startup test_router_running History
TopoTest Master arm8 2 secs
test setup failure
E   AssertionError
Collapse Failed test_all_protocol_startup test_ripng_status History
TopoTest Master arm8 < 1 sec
test setup failure
E   AssertionError
Collapse Failed test_all_protocol_startup test_bgp_ipv6_summary History
TopoTest Master arm8 < 1 sec
test setup failure
E   AssertionError
Collapse Failed test_all_protocol_startup test_isis_interfaces History
TopoTest Master arm8 < 1 sec
test setup failure
E   AssertionError
Collapse Failed test_bgp_ecmp_topo1 test_bgp_ecmp History
TopoTest Master arm7 < 1 sec
test setup failure
E   AssertionError
Collapse Failed test_bgp_ecmp_topo1 test_bgp_convergence History
TopoTest Master arm7 7 secs
test setup failure
E   AssertionError
Collapse Failed test_bgp_ecmp_topo1 test_bgp_convergence History
TopoTest Master arm8 4 secs
test setup failure
E   AssertionError
Collapse Failed test_bgp_ecmp_topo1 test_bgp_ecmp History
TopoTest Master arm8 < 1 sec
test setup failure
E   AssertionError
Collapse Failed test_bgp_l3vpn_to_bgp_direct test_adjacencies History
TopoTest Master arm7 3 secs
test setup failure
E   AssertionError
Collapse Failed test_bgp_l3vpn_to_bgp_direct test_memory_leak History
TopoTest Master arm7 < 1 sec
test setup failure
E   AssertionError
Collapse Failed test_bgp_l3vpn_to_bgp_direct test_cleanup_all History
TopoTest Master arm7 < 1 sec
test setup failure
E   AssertionError
Collapse Failed test_bgp_l3vpn_to_bgp_direct test_check_routes History
TopoTest Master arm7 < 1 sec
test setup failure
E   AssertionError
Collapse Failed test_bgp_l3vpn_to_bgp_direct test_add_routes History
TopoTest Master arm7 < 1 sec
test setup failure
E   AssertionError
Collapse Failed test_bgp_l3vpn_to_bgp_direct test_add_routes History
TopoTest Master arm8 < 1 sec
test setup failure
E   AssertionError
Collapse Failed test_bgp_l3vpn_to_bgp_direct test_check_routes History
TopoTest Master arm8 < 1 sec
test setup failure
E   AssertionError
Collapse Failed test_bgp_l3vpn_to_bgp_direct test_cleanup_all History
TopoTest Master arm8 < 1 sec
test setup failure
E   AssertionError
Collapse Failed test_bgp_l3vpn_to_bgp_direct test_adjacencies History
TopoTest Master arm8 3 secs
test setup failure
E   AssertionError
Collapse Failed test_bgp_l3vpn_to_bgp_direct test_memory_leak History
TopoTest Master arm8 < 1 sec
test setup failure
E   AssertionError
Collapse Failed test_bgp_l3vpn_to_bgp_vrf test_check_routes History
TopoTest Master amd64 2 secs
AssertionError: 1 tests failed
E   AssertionError: 1 tests failed
Collapse Failed test_bgp_l3vpn_to_bgp_vrf test_memory_leak History
TopoTest Master arm7 < 1 sec
test setup failure
E   AssertionError
Collapse Failed test_bgp_l3vpn_to_bgp_vrf test_adjacencies History
TopoTest Master arm7 < 1 sec
test setup failure
E   AssertionError
Collapse Failed test_bgp_l3vpn_to_bgp_vrf test_check_routes History
TopoTest Master arm7 < 1 sec
test setup failure
E   AssertionError
Collapse Failed test_bgp_l3vpn_to_bgp_vrf test_check_linux_vrf History
TopoTest Master arm7 2 secs
test setup failure
E   AssertionError
Collapse Failed test_bgp_l3vpn_to_bgp_vrf test_check_linux_mpls History
TopoTest Master arm7 < 1 sec
test setup failure
E   AssertionError

Shared artifacts

Artifact File size
VersionInfo 766 bytes
SourceCode 4 MB
topotests 427 KB