Testing PullReq against Topology Tests

Build: #331 failed Custom build by Github Hook with revision master

Build result summary

Details

Completed
Duration
31 minutes
Flags
Custom revisionCustom build
Labels
version=frr-5_1-dev-1278-g24a04145cgit=https_//github_com/frrouting/topotests_gitbuildurl=https_//ci1_netdef_org/browse/frr-topopr-cf-331branch=master
Revisions
FRR - Topotests
master master
FRR - FreeRangeRouting
24a04145c553553e07f97d7c4e1c6daf68e5781c 24a04145c553553e07f97d7c4e1c6daf68e5781c
Total tests
873
Failing since
#330 (Custom build by Github Hook with revision master)
Fixed in
#332 (Custom build by Github Hook with revision master)

Tests

Custom variables

Custom revision
master master
Name Value
github_base_sha 791898c795629b2e8c74f290acf5b913efe36788
github_pullreq 120
github_branch master
github_repo FRRouting/topotests
github_merge_sha 38df86d96d3d62640faeda9a700f45d2b7f36568

Comments

  1. Github Hook

    GitHub Merge Request 120
    for GitHub Repo FRRouting/topotests, branch master

    Request to merge from qlyoung/topotests
    Merge Git Commit ID 38df86d96d3d62640faeda9a700f45d2b7f36568 on top of base Git Commit ID 791898c795629b2e8c74f290acf5b913efe36788

Code commits

FRR - Topotests
Author Commit Message Commit date
Rafael Zalamena <rzalamena@users.noreply.github.com> Rafael Zalamena <rzalamena@users.noreply.github.com> 791898c795629b2e8c74f290acf5b913efe36788 791898c795629b2e8c74f290acf5b913efe36788 Merge pull request #119 from LabNConsulting/working/vrf_long_adjacencies
allow for longer time needed to establish adjacencies
FRR - FreeRangeRouting
Author Commit Message Commit date
Quentin Young Quentin Young 24a04145c553553e07f97d7c4e1c6daf68e5781c 24a04145c553553e07f97d7c4e1c6daf68e5781c Merge pull request #2837 from ppmathis/cidr-style
bgpd: Always show CIDR mask when displaying routes
Donald Sharp Donald Sharp 32b83211673cf3c17a40799fea502afee4b4cd65 32b83211673cf3c17a40799fea502afee4b4cd65 Merge pull request #2840 from opensourcerouting/snap-bfdd
snapcraft: Add bfdd to snap package
Donald Sharp Donald Sharp c4a811668dce557da0ca014765a526fdd01bcbce c4a811668dce557da0ca014765a526fdd01bcbce Merge pull request #2843 from LabNConsulting/working/lb/doc-solo
bgpd: document how to avoid reflecting advertised information back to originator
Lou Berger Lou Berger 199ad5c47fd4cf53b19df6aaefa656732ea816a7 199ad5c47fd4cf53b19df6aaefa656732ea816a7 user: document neighbor ... solo config
Signed-off-by: Lou Berger <lberger@labn.net>

Tests

New test failures 5
Status Test View job Duration
Collapse Failed test_all_protocol_startup test_bgp_ipv4 History
TopoTest 5.0 Branch < 1 sec
AssertionError: SHOW BGP IPv4 failed for router r1: No template matched. template /root/bamboo-agent-home/xml-data/build-dir/FRR-TOPOPR-T5B/topotests/all-protocol-startup/r1/show_bgp_ipv4-post4.1.ref: r1 failed SHOW BGP IPv4 check: --- actual SHOW BGP IPv4 +++ expected SHOW BGP IPv4 @@ -5,4 +5,4 @@  Origin codes:  i - IGP, e - EGP, ? - incomplete       Network          Next Hop            Metric LocPrf Weight Path -*> 192.168.0.0      0.0.0.0                  0         32768 i +*> 192.168.0.0/24   0.0.0.0                  0         32768 i template /root/bamboo-agent-home/xml-data/build-dir/FRR-TOPOPR-T5B/topotests/all-protocol-startup/r1/show_bgp_ipv4.ref: r1 failed SHOW BGP IPv4 check: --- actual SHOW BGP IPv4 +++ expected SHOW BGP IPv4 @@ -1,8 +1,7 @@ -BGP table version is 1, local router ID is 192.168.0.1, vrf id 0 -Status codes:  s suppressed, d damped, h history, * valid, > best, = multipath, -               i internal, r RIB-failure, S Stale, R Removed -Nexthop codes: @NNN nexthop's vrf id, < announce-nh-self -Origin codes:  i - IGP, e - EGP, ? - incomplete +BGP table version is 1, local router ID is 192.168.0.1 +Status codes: s suppressed, d damped, h history, * valid, > best, = multipath, +              i internal, r RIB-failure, S Stale, R Removed +Origin codes: i - IGP, e - EGP, ? - incomplete       Network          Next Hop            Metric LocPrf Weight Path  *> 192.168.0.0      0.0.0.0                  0         32768 i
E   AssertionError: SHOW BGP IPv4 failed for router r1:
    No template matched.
    template /root/bamboo-agent-home/xml-data/build-dir/FRR-TOPOPR-T5B/topotests/all-protocol-startup/r1/show_bgp_ipv4-post4.1.ref: r1 failed SHOW BGP IPv4 check:
    --- actual SHOW BGP IPv4
    +++ expected SHOW BGP IPv4
    @@ -5,4 +5,4 @@
     Origin codes:  i - IGP, e - EGP, ? - incomplete
(20 more lines...)
Collapse Failed test_all_protocol_startup test_bgp_ipv4 History
TopoTest Master amd64 < 1 sec
AssertionError: SHOW BGP IPv4 failed for router r1: No template matched. template /root/bamboo-agent-home/xml-data/build-dir/FRR-TOPOPR-TMB/topotests/all-protocol-startup/r1/show_bgp_ipv4-post4.1.ref: r1 failed SHOW BGP IPv4 check: --- actual SHOW BGP IPv4 +++ expected SHOW BGP IPv4 @@ -5,4 +5,4 @@  Origin codes:  i - IGP, e - EGP, ? - incomplete       Network          Next Hop            Metric LocPrf Weight Path -*> 192.168.0.0      0.0.0.0                  0         32768 i +*> 192.168.0.0/24   0.0.0.0                  0         32768 i template /root/bamboo-agent-home/xml-data/build-dir/FRR-TOPOPR-TMB/topotests/all-protocol-startup/r1/show_bgp_ipv4.ref: r1 failed SHOW BGP IPv4 check: --- actual SHOW BGP IPv4 +++ expected SHOW BGP IPv4 @@ -1,8 +1,7 @@ -BGP table version is 1, local router ID is 192.168.0.1, vrf id 0 -Status codes:  s suppressed, d damped, h history, * valid, > best, = multipath, -               i internal, r RIB-failure, S Stale, R Removed -Nexthop codes: @NNN nexthop's vrf id, < announce-nh-self -Origin codes:  i - IGP, e - EGP, ? - incomplete +BGP table version is 1, local router ID is 192.168.0.1 +Status codes: s suppressed, d damped, h history, * valid, > best, = multipath, +              i internal, r RIB-failure, S Stale, R Removed +Origin codes: i - IGP, e - EGP, ? - incomplete       Network          Next Hop            Metric LocPrf Weight Path  *> 192.168.0.0      0.0.0.0                  0         32768 i
E   AssertionError: SHOW BGP IPv4 failed for router r1:
    No template matched.
    template /root/bamboo-agent-home/xml-data/build-dir/FRR-TOPOPR-TMB/topotests/all-protocol-startup/r1/show_bgp_ipv4-post4.1.ref: r1 failed SHOW BGP IPv4 check:
    --- actual SHOW BGP IPv4
    +++ expected SHOW BGP IPv4
    @@ -5,4 +5,4 @@
     Origin codes:  i - IGP, e - EGP, ? - incomplete
(20 more lines...)
Collapse Failed test_all_protocol_startup test_bgp_ipv4 History
TopoTest Master arm7 1 sec
AssertionError: SHOW BGP IPv4 failed for router r1: No template matched. template /root/bamboo-agent-home/xml-data/build-dir/FRR-TOPOPR-TMARM7/topotests/all-protocol-startup/r1/show_bgp_ipv4.ref: r1 failed SHOW BGP IPv4 check: --- actual SHOW BGP IPv4 +++ expected SHOW BGP IPv4 @@ -1,8 +1,7 @@ -BGP table version is 1, local router ID is 192.168.0.1, vrf id 0 -Status codes:  s suppressed, d damped, h history, * valid, > best, = multipath, -               i internal, r RIB-failure, S Stale, R Removed -Nexthop codes: @NNN nexthop's vrf id, < announce-nh-self -Origin codes:  i - IGP, e - EGP, ? - incomplete +BGP table version is 1, local router ID is 192.168.0.1 +Status codes: s suppressed, d damped, h history, * valid, > best, = multipath, +              i internal, r RIB-failure, S Stale, R Removed +Origin codes: i - IGP, e - EGP, ? - incomplete       Network          Next Hop            Metric LocPrf Weight Path  *> 192.168.0.0      0.0.0.0                  0         32768 i template /root/bamboo-agent-home/xml-data/build-dir/FRR-TOPOPR-TMARM7/topotests/all-protocol-startup/r1/show_bgp_ipv4-post4.1.ref: r1 failed SHOW BGP IPv4 check: --- actual SHOW BGP IPv4 +++ expected SHOW BGP IPv4 @@ -5,4 +5,4 @@  Origin codes:  i - IGP, e - EGP, ? - incomplete       Network          Next Hop            Metric LocPrf Weight Path -*> 192.168.0.0      0.0.0.0                  0         32768 i +*> 192.168.0.0/24   0.0.0.0                  0         32768 i
E   AssertionError: SHOW BGP IPv4 failed for router r1:
    No template matched.
    template /root/bamboo-agent-home/xml-data/build-dir/FRR-TOPOPR-TMARM7/topotests/all-protocol-startup/r1/show_bgp_ipv4.ref: r1 failed SHOW BGP IPv4 check:
    --- actual SHOW BGP IPv4
    +++ expected SHOW BGP IPv4
    @@ -1,8 +1,7 @@
    -BGP table version is 1, local router ID is 192.168.0.1, vrf id 0
(20 more lines...)
Collapse Failed test_all_protocol_startup test_bgp_ipv4 History
TopoTest Master arm8 < 1 sec
AssertionError: SHOW BGP IPv4 failed for router r1: No template matched. template /root/bamboo-agent-home/xml-data/build-dir/FRR-TOPOPR-TMARM8/topotests/all-protocol-startup/r1/show_bgp_ipv4.ref: r1 failed SHOW BGP IPv4 check: --- actual SHOW BGP IPv4 +++ expected SHOW BGP IPv4 @@ -1,8 +1,7 @@ -BGP table version is 1, local router ID is 192.168.0.1, vrf id 0 -Status codes:  s suppressed, d damped, h history, * valid, > best, = multipath, -               i internal, r RIB-failure, S Stale, R Removed -Nexthop codes: @NNN nexthop's vrf id, < announce-nh-self -Origin codes:  i - IGP, e - EGP, ? - incomplete +BGP table version is 1, local router ID is 192.168.0.1 +Status codes: s suppressed, d damped, h history, * valid, > best, = multipath, +              i internal, r RIB-failure, S Stale, R Removed +Origin codes: i - IGP, e - EGP, ? - incomplete       Network          Next Hop            Metric LocPrf Weight Path  *> 192.168.0.0      0.0.0.0                  0         32768 i template /root/bamboo-agent-home/xml-data/build-dir/FRR-TOPOPR-TMARM8/topotests/all-protocol-startup/r1/show_bgp_ipv4-post4.1.ref: r1 failed SHOW BGP IPv4 check: --- actual SHOW BGP IPv4 +++ expected SHOW BGP IPv4 @@ -5,4 +5,4 @@  Origin codes:  i - IGP, e - EGP, ? - incomplete       Network          Next Hop            Metric LocPrf Weight Path -*> 192.168.0.0      0.0.0.0                  0         32768 i +*> 192.168.0.0/24   0.0.0.0                  0         32768 i
E   AssertionError: SHOW BGP IPv4 failed for router r1:
    No template matched.
    template /root/bamboo-agent-home/xml-data/build-dir/FRR-TOPOPR-TMARM8/topotests/all-protocol-startup/r1/show_bgp_ipv4.ref: r1 failed SHOW BGP IPv4 check:
    --- actual SHOW BGP IPv4
    +++ expected SHOW BGP IPv4
    @@ -1,8 +1,7 @@
    -BGP table version is 1, local router ID is 192.168.0.1, vrf id 0
(20 more lines...)
Collapse Failed test_all_protocol_startup test_bgp_ipv4 History
TopoTest Master i386 < 1 sec
AssertionError: SHOW BGP IPv4 failed for router r1: No template matched. template /root/bamboo-agent-home/xml-data/build-dir/FRR-TOPOPR-TMI386/topotests/all-protocol-startup/r1/show_bgp_ipv4-post4.1.ref: r1 failed SHOW BGP IPv4 check: --- actual SHOW BGP IPv4 +++ expected SHOW BGP IPv4 @@ -5,4 +5,4 @@  Origin codes:  i - IGP, e - EGP, ? - incomplete       Network          Next Hop            Metric LocPrf Weight Path -*> 192.168.0.0      0.0.0.0                  0         32768 i +*> 192.168.0.0/24   0.0.0.0                  0         32768 i template /root/bamboo-agent-home/xml-data/build-dir/FRR-TOPOPR-TMI386/topotests/all-protocol-startup/r1/show_bgp_ipv4.ref: r1 failed SHOW BGP IPv4 check: --- actual SHOW BGP IPv4 +++ expected SHOW BGP IPv4 @@ -1,8 +1,7 @@ -BGP table version is 1, local router ID is 192.168.0.1, vrf id 0 -Status codes:  s suppressed, d damped, h history, * valid, > best, = multipath, -               i internal, r RIB-failure, S Stale, R Removed -Nexthop codes: @NNN nexthop's vrf id, < announce-nh-self -Origin codes:  i - IGP, e - EGP, ? - incomplete +BGP table version is 1, local router ID is 192.168.0.1 +Status codes: s suppressed, d damped, h history, * valid, > best, = multipath, +              i internal, r RIB-failure, S Stale, R Removed +Origin codes: i - IGP, e - EGP, ? - incomplete       Network          Next Hop            Metric LocPrf Weight Path  *> 192.168.0.0      0.0.0.0                  0         32768 i
E   AssertionError: SHOW BGP IPv4 failed for router r1:
    No template matched.
    template /root/bamboo-agent-home/xml-data/build-dir/FRR-TOPOPR-TMI386/topotests/all-protocol-startup/r1/show_bgp_ipv4-post4.1.ref: r1 failed SHOW BGP IPv4 check:
    --- actual SHOW BGP IPv4
    +++ expected SHOW BGP IPv4
    @@ -5,4 +5,4 @@
     Origin codes:  i - IGP, e - EGP, ? - incomplete
(20 more lines...)

Shared artifacts

Artifact File size
VersionInfo 785 bytes
SourceCode 4 MB
topotests 428 KB