Testing PullReq against Topology Tests

Build: #342 failed Custom build by Github Hook with revision master

Build result summary

Details

Completed
Duration
37 minutes
Flags
Custom revisionCustom build
Labels
version=frr-5_1-dev-1482-g95d8c3ce7git=https_//github_com/frrouting/topotests_gitbuildurl=https_//ci1_netdef_org/browse/frr-topopr-cf-342branch=master
Revisions
FRR - Topotests
master master
FRR - FreeRangeRouting
95d8c3ce78cdd800f4c39d196e865c2ec9213f03 95d8c3ce78cdd800f4c39d196e865c2ec9213f03
Total tests
972
Fixed in
#344 (Rebuilt by Martin Winter)

Custom variables

Custom revision
master master
Name Value
github_base_sha b081543bb451cf1e13d3979ae85127de3f7c8c70
github_pullreq 128
github_branch master
github_repo FRRouting/topotests
github_merge_sha 6cab4e1bd4eb3564376a63a6482528502169cb09

Comments

  1. Github Hook

    GitHub Merge Request 128
    for GitHub Repo FRRouting/topotests, branch master

    Request to merge from LabNConsulting/topotests
    Merge Git Commit ID 6cab4e1bd4eb3564376a63a6482528502169cb09 on top of base Git Commit ID b081543bb451cf1e13d3979ae85127de3f7c8c70

Code commits

FRR - Topotests
Author Commit Message Commit date
Rafael Zalamena <rzalamena@users.noreply.github.com> Rafael Zalamena <rzalamena@users.noreply.github.com> b081543bb451cf1e13d3979ae85127de3f7c8c70 b081543bb451cf1e13d3979ae85127de3f7c8c70 Merge pull request #126 from opensourcerouting/zebraroutefun-fix
lib: fix `ip4_route_zebra` header removal code
FRR - FreeRangeRouting
Author Commit Message Commit date
Lou Berger Lou Berger 95d8c3ce78cdd800f4c39d196e865c2ec9213f03 95d8c3ce78cdd800f4c39d196e865c2ec9213f03 Merge pull request #2898 from donaldsharp/vrf_bitmap_is_whack
lib: Convert vrf bit-map to a hash.
David Lamparter David Lamparter b5d79dbe71efb5da59ccb39fae6da36291c3b7a0 b5d79dbe71efb5da59ccb39fae6da36291c3b7a0 Merge pull request #2920 from donaldsharp/bsd_warnings
Bsd warnings
Donald Sharp Donald Sharp f7dae31211dedf2e66f7d8bebdc9ff7f148eceef f7dae31211dedf2e66f7d8bebdc9ff7f148eceef zebra: No prototype and uninited variables
Add a header to cleanup no declaration and properly
wrapper some variables to appropriate #ifdef.

Signed-off-by: Donald Sharp <sharpd@cumulusnetworks.com>
Donald Sharp Donald Sharp 344b4a29bf41577c25d1bfc2db62f22f412a7c0d 344b4a29bf41577c25d1bfc2db62f22f412a7c0d isisd: Include header for function declaration
isis_handle_pdu is called but not declared for usage
by not including the appropriate header.

Signed-off-by: Donald Sharp <sharpd@cumulusnetworks.com>

Tests

New test failures 6
Status Test View job Duration
Collapse Failed test_bgp_rfapi_basic_sanity test_adjacencies History
AddressSanitizer 3 mins
AssertionError: 10 tests failed
E   AssertionError: 10 tests failed
Collapse Failed test_bgp_rfapi_basic_sanity test_adjacencies History
TopoTest 4.0 Branch 3 mins
AssertionError: 10 tests failed
E   AssertionError: 10 tests failed
Collapse Failed test_bgp_rfapi_basic_sanity test_adjacencies History
TopoTest 5.0 Branch 3 mins
AssertionError: 10 tests failed
E   AssertionError: 10 tests failed
Collapse Failed test_bgp_rfapi_basic_sanity test_adjacencies History
TopoTest Master amd64 3 mins
AssertionError: 10 tests failed
E   AssertionError: 10 tests failed
Collapse Failed test_bgp_rfapi_basic_sanity test_adjacencies History
TopoTest Master arm8 3 mins
AssertionError: 10 tests failed
E   AssertionError: 10 tests failed
Collapse Failed test_bgp_rfapi_basic_sanity test_adjacencies History
TopoTest Master i386 3 mins
AssertionError: 10 tests failed
E   AssertionError: 10 tests failed

Shared artifacts

Artifact File size
VersionInfo 785 bytes
SourceCode 4 MB
topotests 484 KB