Testing PullReq against Topology Tests

Build: #381 failed Custom build by Github Hook with revision master

Build result summary

Details

Completed
Duration
44 minutes
Flags
Custom revisionCustom build
Labels
version=frr-6_1-dev-730-g8dfa7e468git=https_//github_com/frrouting/topotests_gitbuildurl=https_//ci1_netdef_org/browse/frr-topopr-cf-381branch=master
Revisions
FRR - Topotests
master master
FRR - FreeRangeRouting
8dfa7e4680c3d8f2606d7fdef77df0e9cb44c645 8dfa7e4680c3d8f2606d7fdef77df0e9cb44c645
Total tests
1270

Custom variables

Custom revision
master master
Name Value
github_base_sha bfe9350d964b36b58ddf85f44919e2330474e4b5
github_pullreq 139
github_branch master
github_repo FRRouting/topotests
github_merge_sha 361880ea7f3b1b94e73661cace52f9a7b7bd1204

Comments

  1. Github Hook

    GitHub Merge Request 139
    for GitHub Repo FRRouting/topotests, branch master

    Request to merge from pguibert6WIND/topotests
    Merge Git Commit ID 361880ea7f3b1b94e73661cace52f9a7b7bd1204 on top of base Git Commit ID bfe9350d964b36b58ddf85f44919e2330474e4b5

Code commits

FRR - Topotests
Author Commit Message Commit date
Rafael Zalamena <rzalamena@users.noreply.github.com> Rafael Zalamena <rzalamena@users.noreply.github.com> 132ffd115b89efd6c21aba86f2cd362b61035b2f 132ffd115b89efd6c21aba86f2cd362b61035b2f Merge pull request #138 from pguibert6WIND/movevrfdeftodefault
bgp-ecmp-topo1: change default vrf name
FRR - FreeRangeRouting
Author Commit Message Commit date
Renato Westphal <renato@openbsd.org> Renato Westphal <renato@openbsd.org> 8dfa7e4680c3d8f2606d7fdef77df0e9cb44c645 8dfa7e4680c3d8f2606d7fdef77df0e9cb44c645 Merge pull request #3162 from pguibert6WIND/vpn_route_map_issue
bgpd: vpn route-map config should be kept, except if vrf list is on
Renato Westphal <renato@openbsd.org> Renato Westphal <renato@openbsd.org> fb52f65126f6f5a053ac86e8ca871db02e70ab6d fb52f65126f6f5a053ac86e8ca871db02e70ab6d Merge pull request #3271 from donaldsharp/nh_encode_better
lib, zebra: Encode nexthop vrf in nht updates
Donald Sharp Donald Sharp a756969dc61880d781060a9387c7bdf6da02a238 a756969dc61880d781060a9387c7bdf6da02a238 pimd, zebra: Encode nexthop vrf in message
Encode the nexthop vrf in the message sent about mrib lookups.

Signed-off-by: Donald Sharp <sharpd@cumulusnetworks.com>
Donald Sharp Donald Sharp b6c9de3bd3eb750a0ce1fcca66a38416a8d767d0 b6c9de3bd3eb750a0ce1fcca66a38416a8d767d0 lib, zebra: Encode nexthop vrf in nht updates
The nexthop vrf was not being encoded in nht updates.
Add it in.

Signed-off-by: Donald Sharp <sharpd@cumulusnetworks.com>

Tests

New test failures 4
Status Test View job Duration
Collapse Failed test_bgp_vrf_leakip_topo test_bgp_vrf_ipleak History
AddressSanitizer 4 secs
test teardown failure
E   AssertionError: 
    r1: Daemon zebra killed by AddressSanitizer
Collapse Failed test_bgp_vrf_leakip_topo test_bgp_vrf_ipleak History
TopoTest Master amd64 2 secs
test teardown failure
E   AssertionError: 
    r1: zebra crashed. Core file found - Backtrace follows:
    [New LWP 10534]
    [Thread debugging using libthread_db enabled]
    Using host libthread_db library "/lib/x86_64-linux-gnu/libthread_db.so.1".
    Core was generated by `/usr/lib/frr/zebra --vrfwnetns'.
    Program terminated with signal SIGABRT, Aborted.
(19 more lines...)
Collapse Failed test_bgp_vrf_leakip_topo test_bgp_vrf_ipleak History
TopoTest Master arm8 4 secs
test teardown failure
E   AssertionError: 
    r1: zebra crashed. Core file found - Backtrace follows:
    [New LWP 25348]
    [Thread debugging using libthread_db enabled]
    Using host libthread_db library "/lib/aarch64-linux-gnu/libthread_db.so.1".
    Core was generated by `/usr/lib/frr/zebra --vrfwnetns'.
    Program terminated with signal SIGABRT, Aborted.
(19 more lines...)
Collapse Failed test_bgp_rfapi_basic_sanity_config2 test_check_timeout History
AddressSanitizer 1 min
AssertionError: 1 tests failed
E   AssertionError: 1 tests failed

Shared artifacts

Artifact File size
VersionInfo 784 bytes
SourceCode 4 MB
topotests 539 KB