Testing PullReq against Topology Tests

Build: #382 failed Custom build by Github Hook with revision docker

Build result summary

Details

Completed
Duration
38 minutes
Flags
Custom revisionCustom build
Labels
version=frr-6_1-dev-746-g3759776ccgit=https_//github_com/frrouting/topotests_gitbuildurl=https_//ci1_netdef_org/browse/frr-topopr-cf-382branch=docker
Revisions
FRR - Topotests
docker docker
FRR - FreeRangeRouting
3759776ccd68ca8b7e4fdf94d96e288d5b5cd903 3759776ccd68ca8b7e4fdf94d96e288d5b5cd903
Total tests
1240
Failing since
#381 (Custom build by Github Hook with revision master)
Fixed in
#391 (Custom build by Github Hook with revision master)

Tests

Custom variables

Custom revision
docker docker
Name Value
github_base_sha 634b1d6f46fefada44b8f147c70e746b18fccf4f
github_pullreq 141
github_branch docker
github_repo FRRouting/topotests
github_merge_sha 524bdf93d0f9a2ab0d64592e25a83dea0eeb2901

Comments

  1. Github Hook

    GitHub Merge Request 141
    for GitHub Repo FRRouting/topotests, branch docker

    Request to merge from cfra/topotests
    Merge Git Commit ID 524bdf93d0f9a2ab0d64592e25a83dea0eeb2901 on top of base Git Commit ID 634b1d6f46fefada44b8f147c70e746b18fccf4f

Code commits

FRR - Topotests
Author Commit Message Commit date
Rafael Zalamena <rzalamena@users.noreply.github.com> Rafael Zalamena <rzalamena@users.noreply.github.com> c83fcc3c9fc8e6fe532aaceb54fcb0599b7c4fb0 c83fcc3c9fc8e6fe532aaceb54fcb0599b7c4fb0 Merge pull request #140 from cfra/bugfix/fail-on-compile-error
bugfix: Fail on compile error
FRR - FreeRangeRouting
Author Commit Message Commit date
Olivier Dugeon <olivier.dugeon@orange.com> Olivier Dugeon <olivier.dugeon@orange.com> 3759776ccd68ca8b7e4fdf94d96e288d5b5cd903 3759776ccd68ca8b7e4fdf94d96e288d5b5cd903 Merge pull request #3298 from ak503/mpls_te2
ospfd: unregister mpls-te inter-as only if mpls-te is enabled
Dmitrii Turlupov <dturlupov@factor-ts.ru> Dmitrii Turlupov <dturlupov@factor-ts.ru> e790de4101d1d966639e66dfe4770f85ca06dc75 e790de4101d1d966639e66dfe4770f85ca06dc75 ospf: unregister mpls-te inter-as only if mpls-te is enabled
Signed-off-by: Dmitrii Turlupov <dturlupov@factor-ts.ru>
Olivier Dugeon <olivier.dugeon@orange.com> Olivier Dugeon <olivier.dugeon@orange.com> ddd73a968dc61766b6a44442c0bccd7ff0a643a8 ddd73a968dc61766b6a44442c0bccd7ff0a643a8 OSPF: Add support to multi-area to Router Info.
  Router Information needs to specify the area ID when flooding scope is set to
  AREA. However, this authorize only one AREA. Thus, Area Border Router (ABR) are
  unable to flood Router Information Opaque LSA in all areas they are belongs to.

  The path implies that the area ID is no more necessary for the command
  'router-info area'. It remains suported for compatibility, but mark as
  deprecated. Documentation has been updated accordingly.

Signed-off-by: Olivier Dugeon <olivier.dugeon@orange.com>
Russ White <russ@riw.us> Russ White <russ@riw.us> 2379dbecbd3b56ef1affc9127b8eb44f61d591fa 2379dbecbd3b56ef1affc9127b8eb44f61d591fa Merge pull request #3202 from donaldsharp/evpn_dump
Evpn dump

Tests

New test failures 6
Status Test View job Duration
Collapse Failed test_bgp_ecmp_topo1 test_bgp_convergence History
AddressSanitizer 1 min
AssertionError: BGP router network did not converge assert json["ipv4Unicast"]["vrfName"] value is different (   --- Expected value   +++ Current value   @@ -1 +1 @@   -"Default"   +"default")
E   AssertionError: BGP router network did not converge
    assert json["ipv4Unicast"]["vrfName"] value is different (
      --- Expected value
      +++ Current value
      @@ -1 +1 @@
      -"Default"
      +"default")
Collapse Failed test_bgp_ecmp_topo1 test_bgp_convergence History
TopoTest Master amd64 54 secs
AssertionError: BGP router network did not converge assert json["ipv4Unicast"]["vrfName"] value is different (   --- Expected value   +++ Current value   @@ -1 +1 @@   -"Default"   +"default")
E   AssertionError: BGP router network did not converge
    assert json["ipv4Unicast"]["vrfName"] value is different (
      --- Expected value
      +++ Current value
      @@ -1 +1 @@
      -"Default"
      +"default")
Collapse Failed test_bgp_ecmp_topo1 test_bgp_convergence History
TopoTest Master arm7 1 min
AssertionError: BGP router network did not converge assert json["ipv4Unicast"]["vrfName"] value is different (   --- Expected value   +++ Current value   @@ -1 +1 @@   -"Default"   +"default")
E   AssertionError: BGP router network did not converge
    assert json["ipv4Unicast"]["vrfName"] value is different (
      --- Expected value
      +++ Current value
      @@ -1 +1 @@
      -"Default"
      +"default")
Collapse Failed test_bgp_ecmp_topo1 test_bgp_convergence History
TopoTest Master arm8 1 min
AssertionError: BGP router network did not converge assert json["ipv4Unicast"]["vrfName"] value is different (   --- Expected value   +++ Current value   @@ -1 +1 @@   -"Default"   +"default")
E   AssertionError: BGP router network did not converge
    assert json["ipv4Unicast"]["vrfName"] value is different (
      --- Expected value
      +++ Current value
      @@ -1 +1 @@
      -"Default"
      +"default")
Collapse Failed test_bgp_ecmp_topo1 test_bgp_convergence History
TopoTest Master i386 55 secs
AssertionError: BGP router network did not converge assert json["ipv4Unicast"]["vrfName"] value is different (   --- Expected value   +++ Current value   @@ -1 +1 @@   -"Default"   +"default")
E   AssertionError: BGP router network did not converge
    assert json["ipv4Unicast"]["vrfName"] value is different (
      --- Expected value
      +++ Current value
      @@ -1 +1 @@
      -"Default"
      +"default")
Collapse Failed test_ospf6_topo1 test_linux_ipv6_kernel_routingTable History
TopoTest Master arm8 < 1 sec
AssertionError: Linux Kernel IPv6 Routing Table verification failed for router r3:   --- actual OSPFv3 IPv6 routing table   +++ expected OSPFv3 IPv6 routing table   @@ -4,8 +4,8 @@    fc00:2:2:2::/64 via fe80::__(r2-sw5)__ dev r3-sw5 proto XXXX metric 20 pref medium    fc00:3333:3333:3333::/64 via fc00:3:3:3::1234 dev r3-stubnet proto XXXX metric 20 pref medium    fc00:3:3:3::/64 dev r3-stubnet proto XXXX metric 256 pref medium   -fc00:4444:4444:4444::/64 via fe80::6eff:fe4a:ea80 dev r3-sw6 proto XXXX metric 20 pref medium   -fc00:4:4:4::/64 via fe80::6eff:fe4a:ea80 dev r3-sw6 proto XXXX metric 20 pref medium   +fc00:4444:4444:4444::/64 via fe80::__(r4-sw6)__ dev r3-sw6 proto XXXX metric 20 pref medium   +fc00:4:4:4::/64 via fe80::__(r4-sw6)__ dev r3-sw6 proto XXXX metric 20 pref medium    fc00:a:a:a::/64 dev r3-sw5 proto XXXX metric 256 pref medium    fc00:b:b:b::/64 dev r3-sw6 proto XXXX metric 256 pref medium    fe80::/64 dev r3-stubnet proto XXXX metric 256 pref medium assert 1 == 0
E   AssertionError: Linux Kernel IPv6 Routing Table verification failed for router r3:
      --- actual OSPFv3 IPv6 routing table
      +++ expected OSPFv3 IPv6 routing table
      @@ -4,8 +4,8 @@
       fc00:2:2:2::/64 via fe80::__(r2-sw5)__ dev r3-sw5 proto XXXX metric 20 pref medium
       fc00:3333:3333:3333::/64 via fc00:3:3:3::1234 dev r3-stubnet proto XXXX metric 20 pref medium
       fc00:3:3:3::/64 dev r3-stubnet proto XXXX metric 256 pref medium
(8 more lines...)

Shared artifacts

Artifact File size
VersionInfo 784 bytes
SourceCode 4 MB
topotests 540 KB