Testing PullReq against Topology Tests

Build: #384 failed Custom build by Github Hook with revision docker

Build result summary

Details

Completed
Duration
41 minutes
Flags
Custom revisionCustom build
Labels
version=frr-6_1-dev-829-gfef6daf4dgit=https_//github_com/frrouting/topotests_gitbuildurl=https_//ci1_netdef_org/browse/frr-topopr-cf-384branch=docker
Revisions
FRR - Topotests
docker docker
FRR - FreeRangeRouting
fef6daf4da425621c4c2e67d7579d962f64f43f7 fef6daf4da425621c4c2e67d7579d962f64f43f7
Total tests
1240
Failing since
#381 (Custom build by Github Hook with revision master)
Fixed in
#391 (Custom build by Github Hook with revision master)

Tests

Custom variables

Custom revision
docker docker
Name Value
github_base_sha c83fcc3c9fc8e6fe532aaceb54fcb0599b7c4fb0
github_pullreq 141
github_branch docker
github_repo FRRouting/topotests
github_merge_sha 6b19ac5fc700105d771eb0d55a4456787af19d41

Comments

  1. Github Hook

    GitHub Merge Request 141
    for GitHub Repo FRRouting/topotests, branch docker

    Request to merge from cfra/topotests
    Merge Git Commit ID 6b19ac5fc700105d771eb0d55a4456787af19d41 on top of base Git Commit ID c83fcc3c9fc8e6fe532aaceb54fcb0599b7c4fb0

Code commits

FRR - Topotests
Author Commit Message Commit date
Rafael Zalamena <rzalamena@users.noreply.github.com> Rafael Zalamena <rzalamena@users.noreply.github.com> c83fcc3c9fc8e6fe532aaceb54fcb0599b7c4fb0 c83fcc3c9fc8e6fe532aaceb54fcb0599b7c4fb0 Merge pull request #140 from cfra/bugfix/fail-on-compile-error
bugfix: Fail on compile error
FRR - FreeRangeRouting
Author Commit Message Commit date
Renato Westphal <renato@openbsd.org> Renato Westphal <renato@openbsd.org> fef6daf4da425621c4c2e67d7579d962f64f43f7 fef6daf4da425621c4c2e67d7579d962f64f43f7 Merge pull request #3341 from donaldsharp/unneeded
zebra: Remove uncompiled file
Renato Westphal <renato@openbsd.org> Renato Westphal <renato@openbsd.org> 996777862ad4050828170269a02093c36d72a9b4 996777862ad4050828170269a02093c36d72a9b4 Merge pull request #3352 from pacovn/Coverity_1475489_resource_leak
bgpd: fix resource leak (Coverity 1475489)
Renato Westphal <renato@openbsd.org> Renato Westphal <renato@openbsd.org> ee1922793fca932ac480d595810be62ff62732ff ee1922793fca932ac480d595810be62ff62732ff Merge pull request #3353 from qlyoung/fix-bgpd-community-list-deletion-nit
bgpd: fix small error in community-list patch
Quentin Young Quentin Young 97bc06df856c26ab180bca0d8e1b13a21efd2fa3 97bc06df856c26ab180bca0d8e1b13a21efd2fa3 Merge pull request #3338 from ton31337/fix/optional_args_for_exclude
bgpd: Optionally remove AS number when using `no set as-path exclude`

Tests

New test failures 6
Status Test View job Duration
Collapse Failed test_bgp_ecmp_topo1 test_bgp_convergence History
AddressSanitizer 1 min
AssertionError: BGP router network did not converge assert json["ipv4Unicast"]["vrfName"] value is different (   --- Expected value   +++ Current value   @@ -1 +1 @@   -"Default"   +"default")
E   AssertionError: BGP router network did not converge
    assert json["ipv4Unicast"]["vrfName"] value is different (
      --- Expected value
      +++ Current value
      @@ -1 +1 @@
      -"Default"
      +"default")
Collapse Failed test_bgp_ecmp_topo1 test_bgp_convergence History
TopoTest Master amd64 54 secs
AssertionError: BGP router network did not converge assert json["ipv4Unicast"]["vrfName"] value is different (   --- Expected value   +++ Current value   @@ -1 +1 @@   -"Default"   +"default")
E   AssertionError: BGP router network did not converge
    assert json["ipv4Unicast"]["vrfName"] value is different (
      --- Expected value
      +++ Current value
      @@ -1 +1 @@
      -"Default"
      +"default")
Collapse Failed test_bgp_ecmp_topo1 test_bgp_convergence History
TopoTest Master arm7 1 min
AssertionError: BGP router network did not converge assert json["ipv4Unicast"]["vrfName"] value is different (   --- Expected value   +++ Current value   @@ -1 +1 @@   -"Default"   +"default")
E   AssertionError: BGP router network did not converge
    assert json["ipv4Unicast"]["vrfName"] value is different (
      --- Expected value
      +++ Current value
      @@ -1 +1 @@
      -"Default"
      +"default")
Collapse Failed test_bgp_ecmp_topo1 test_bgp_convergence History
TopoTest Master arm8 1 min
AssertionError: BGP router network did not converge assert json["ipv4Unicast"]["vrfName"] value is different (   --- Expected value   +++ Current value   @@ -1 +1 @@   -"Default"   +"default")
E   AssertionError: BGP router network did not converge
    assert json["ipv4Unicast"]["vrfName"] value is different (
      --- Expected value
      +++ Current value
      @@ -1 +1 @@
      -"Default"
      +"default")
Collapse Failed test_bgp_ecmp_topo1 test_bgp_convergence History
TopoTest Master i386 54 secs
AssertionError: BGP router network did not converge assert json["ipv4Unicast"]["vrfName"] value is different (   --- Expected value   +++ Current value   @@ -1 +1 @@   -"Default"   +"default")
E   AssertionError: BGP router network did not converge
    assert json["ipv4Unicast"]["vrfName"] value is different (
      --- Expected value
      +++ Current value
      @@ -1 +1 @@
      -"Default"
      +"default")
Collapse Failed test_bgp_rfapi_basic_sanity test_check_timeout History
AddressSanitizer 1 min
AssertionError: 4 tests failed
E   AssertionError: 4 tests failed

Shared artifacts

Artifact File size
VersionInfo 784 bytes
SourceCode 4 MB
topotests 541 KB