Testing PullReq against Topology Tests

Build: #385 failed Manual run by Martin Winter

Test results

  • 1,240 tests in total
  • 4 tests failed
  • 4 failures are new
  • 209 tests were quarantined / skipped
  • 223 minutes taken in total.
New test failures 4
Status Test View job Duration
Collapse Failed test_bfd_topo1 test_bgp_convergence History
AddressSanitizer 43 secs
AssertionError: r2: bgp did not converge assert json["ipv4Unicast"]["peers"]["192.168.1.1"]["state"] value is different (   --- Expected value   +++ Current value   @@ -1 +1 @@   -"Established"   +"Idle")
E   AssertionError: r2: bgp did not converge
    assert json["ipv4Unicast"]["peers"]["192.168.1.1"]["state"] value is different (
      --- Expected value
      +++ Current value
      @@ -1 +1 @@
      -"Established"
      +"Idle")
Collapse Failed test_bfd_topo1 test_bgp_fast_convergence History
AddressSanitizer 1 min
AssertionError: r4: bgp did not converge assert expected key(s) [u'10.254.254.3/32'] in json["routes"] (have [u'10.254.254.4/32', u'10.254.254.2/32', u'10.254.254.1/32']):   --- Expected value   +++ Current value   @@ -4,0 +5,2 @@   +            "bestpath": true,    +            "network": "10.254.254.1/32",    @@ -11,0 +14,3 @@   +            "origin": "IGP",    +            "path": "102 101",    +            "pathFrom": "external",    @@ -15 +20,2 @@   -            "valid": true   +            "valid": true,    +            "weight": 0   @@ -20,0 +27,4 @@   +            "bestpath": true,    +            "med": 0,    +            "metric": 0,    +            "network": "10.254.254.2/32",    @@ -27,0 +38,3 @@   +            "origin": "IGP",    +            "path": "102",    +            "pathFrom": "external",    @@ -31 +44,2 @@   -            "valid": true   +            "valid": true,    +            "weight": 0   @@ -34 +48 @@   -    "10.254.254.3/32": [   +    "10.254.254.4/32": [   @@ -36 +50,5 @@   -            "aspath": "102 103",    +            "aspath": "",    +            "bestpath": true,    +            "med": 0,    +            "metric": 0,    +            "network": "10.254.254.4/32",    @@ -40 +58 @@   -                    "ip": "192.168.2.2",    +                    "ip": "0.0.0.0",    @@ -44,2 +62,5 @@   -            "peerId": "192.168.2.2",    -            "prefix": "10.254.254.3",    +            "origin": "IGP",    +            "path": "",    +            "pathFrom": "external",    +            "peerId": "(unspec)",    +            "prefix": "10.254.254.4",    @@ -47 +68,2 @@   -            "valid": true   +            "valid": true,    +            "weight": 32768
E   AssertionError: r4: bgp did not converge
    assert expected key(s) [u'10.254.254.3/32'] in json["routes"] (have [u'10.254.254.4/32', u'10.254.254.2/32', u'10.254.254.1/32']):
      --- Expected value
      +++ Current value
      @@ -4,0 +5,2 @@
      +            "bestpath": true, 
      +            "network": "10.254.254.1/32", 
(46 more lines...)
Collapse Failed test_bfd_topo1 test_bgp_fast_reconvergence History
AddressSanitizer 13 secs
AssertionError: r4: bgp did not converge assert expected key(s) [u'10.254.254.3/32'] in json["routes"] (have [u'10.254.254.4/32', u'10.254.254.2/32']):   --- Expected value   +++ Current value   @@ -2 +1,0 @@   -    "10.254.254.1/32": null,    @@ -5,0 +5,4 @@   +            "bestpath": true,    +            "med": 0,    +            "metric": 0,    +            "network": "10.254.254.2/32",    @@ -12,0 +16,3 @@   +            "origin": "IGP",    +            "path": "102",    +            "pathFrom": "external",    @@ -16 +22,2 @@   -            "valid": true   +            "valid": true,    +            "weight": 0   @@ -19 +26 @@   -    "10.254.254.3/32": [   +    "10.254.254.4/32": [   @@ -21 +28,5 @@   -            "aspath": "102 103",    +            "aspath": "",    +            "bestpath": true,    +            "med": 0,    +            "metric": 0,    +            "network": "10.254.254.4/32",    @@ -25 +36 @@   -                    "ip": "192.168.2.2",    +                    "ip": "0.0.0.0",    @@ -29,2 +40,5 @@   -            "peerId": "192.168.2.2",    -            "prefix": "10.254.254.3",    +            "origin": "IGP",    +            "path": "",    +            "pathFrom": "external",    +            "peerId": "(unspec)",    +            "prefix": "10.254.254.4",    @@ -32 +46,2 @@   -            "valid": true   +            "valid": true,    +            "weight": 32768
E   AssertionError: r4: bgp did not converge
    assert expected key(s) [u'10.254.254.3/32'] in json["routes"] (have [u'10.254.254.4/32', u'10.254.254.2/32']):
      --- Expected value
      +++ Current value
      @@ -2 +1,0 @@
      -    "10.254.254.1/32": null, 
      @@ -5,0 +5,4 @@
(37 more lines...)
Collapse Failed test_bgp_rfapi_basic_sanity_config2 test_check_timeout History
AddressSanitizer 1 min
AssertionError: 1 tests failed
E   AssertionError: 1 tests failed
Skipped tests 100
Status Test Failing since View job
Skipped test_all_protocol_startup test_shutdown_check_stderr History
AddressSanitizer
Skipped test_all_protocol_startup test_mpls_interfaces History
TopoTest Master arm7
Skipped test_bfd_topo1 test_bgp_convergence History
TopoTest 2.0 Branch
Skipped test_bfd_topo1 test_memory_leak History
TopoTest 2.0 Branch
Skipped test_bfd_topo1 test_bgp_fast_convergence History
TopoTest 2.0 Branch
Skipped test_bfd_topo1 test_bgp_fast_reconvergence History
TopoTest 2.0 Branch
Skipped test_bfd_topo1 test_bfd_connection History
TopoTest 2.0 Branch
Skipped test_bfd_topo1 test_bfd_fast_convergence History
TopoTest 2.0 Branch
Skipped test_bfd_topo1 test_bgp_convergence History
TopoTest 3.0 Branch
Skipped test_bfd_topo1 test_bfd_fast_convergence History
TopoTest 3.0 Branch
Skipped test_bfd_topo1 test_bfd_connection History
TopoTest 3.0 Branch
Skipped test_bfd_topo1 test_bgp_fast_convergence History
TopoTest 3.0 Branch
Skipped test_bfd_topo1 test_bgp_fast_reconvergence History
TopoTest 3.0 Branch
Skipped test_bfd_topo1 test_memory_leak History
TopoTest 3.0 Branch
Skipped test_bfd_topo1 test_bgp_fast_convergence History
TopoTest 4.0 Branch
Skipped test_bfd_topo1 test_memory_leak History
TopoTest 4.0 Branch
Skipped test_bfd_topo1 test_bfd_connection History
TopoTest 4.0 Branch
Skipped test_bfd_topo1 test_bgp_fast_reconvergence History
TopoTest 4.0 Branch
Skipped test_bfd_topo1 test_bfd_fast_convergence History
TopoTest 4.0 Branch
Skipped test_bfd_topo1 test_bgp_convergence History
TopoTest 4.0 Branch
Skipped test_bfd_topo1 test_bfd_connection History
TopoTest 5.0 Branch
Skipped test_bfd_topo1 test_bfd_fast_convergence History
TopoTest 5.0 Branch
Skipped test_bfd_topo1 test_memory_leak History
TopoTest 5.0 Branch
Skipped test_bfd_topo1 test_bgp_fast_convergence History
TopoTest 5.0 Branch
Skipped test_bfd_topo1 test_bgp_fast_reconvergence History
TopoTest 5.0 Branch
Skipped test_bfd_topo1 test_bgp_convergence History
TopoTest 5.0 Branch
Skipped test_bgp_l3vpn_to_bgp_direct test_check_routes History
TopoTest 2.0 Branch
Skipped test_bgp_l3vpn_to_bgp_direct test_adjacencies History
TopoTest 2.0 Branch
Skipped test_bgp_l3vpn_to_bgp_direct test_add_routes History
TopoTest 2.0 Branch
Skipped test_bgp_l3vpn_to_bgp_direct test_cleanup_all History
TopoTest 2.0 Branch
Skipped test_bgp_l3vpn_to_bgp_direct test_add_routes History
TopoTest 3.0 Branch
Skipped test_bgp_l3vpn_to_bgp_direct test_adjacencies History
TopoTest 3.0 Branch
Skipped test_bgp_l3vpn_to_bgp_direct test_check_routes History
TopoTest 3.0 Branch
Skipped test_bgp_l3vpn_to_bgp_direct test_cleanup_all History
TopoTest 3.0 Branch
Skipped test_bgp_l3vpn_to_bgp_vrf test_check_linux_mpls History
AddressSanitizer
Skipped test_bgp_l3vpn_to_bgp_vrf test_check_linux_vrf History
AddressSanitizer
Skipped test_bgp_l3vpn_to_bgp_vrf test_check_linux_vrf History
TopoTest 2.0 Branch
Skipped test_bgp_l3vpn_to_bgp_vrf test_check_routes History
TopoTest 2.0 Branch
Skipped test_bgp_l3vpn_to_bgp_vrf test_check_linux_mpls History
TopoTest 2.0 Branch
Skipped test_bgp_l3vpn_to_bgp_vrf test_adjacencies History
TopoTest 2.0 Branch
Skipped test_bgp_l3vpn_to_bgp_vrf test_check_linux_mpls History
TopoTest 3.0 Branch
Skipped test_bgp_l3vpn_to_bgp_vrf test_check_linux_vrf History
TopoTest 3.0 Branch
Skipped test_bgp_l3vpn_to_bgp_vrf test_check_routes History
TopoTest 3.0 Branch
Skipped test_bgp_l3vpn_to_bgp_vrf test_adjacencies History
TopoTest 3.0 Branch
Skipped test_bgp_l3vpn_to_bgp_vrf test_check_linux_vrf History
TopoTest 4.0 Branch
Skipped test_bgp_l3vpn_to_bgp_vrf test_check_linux_mpls History
TopoTest 4.0 Branch
Skipped test_bgp_l3vpn_to_bgp_vrf test_adjacencies History
TopoTest 4.0 Branch
Skipped test_bgp_l3vpn_to_bgp_vrf test_check_routes History
TopoTest 4.0 Branch
Skipped test_bgp_l3vpn_to_bgp_vrf test_check_linux_mpls History
TopoTest 5.0 Branch
Skipped test_bgp_l3vpn_to_bgp_vrf test_check_linux_vrf History
TopoTest 5.0 Branch
Skipped test_bgp_l3vpn_to_bgp_vrf test_check_linux_vrf History
TopoTest 6.0 Branch
Skipped test_bgp_l3vpn_to_bgp_vrf test_check_linux_mpls History
TopoTest 6.0 Branch
Skipped test_bgp_l3vpn_to_bgp_vrf test_check_linux_vrf History
TopoTest Master amd64
Skipped test_bgp_l3vpn_to_bgp_vrf test_check_linux_mpls History
TopoTest Master amd64
Skipped test_bgp_l3vpn_to_bgp_vrf test_check_linux_vrf History
TopoTest Master i386
Skipped test_bgp_l3vpn_to_bgp_vrf test_check_linux_mpls History
TopoTest Master i386
Skipped test_bgp_multiview_topo1 test_shutdown_check_stderr History
AddressSanitizer
Skipped test_bgp_rfapi_basic_sanity_config2 test_cleanup_all History
AddressSanitizer
Skipped test_bgp_rfapi_basic_sanity_config2 test_adjacencies History
TopoTest 2.0 Branch
Skipped test_bgp_rfapi_basic_sanity_config2 test_add_routes History
TopoTest 2.0 Branch
Skipped test_bgp_rfapi_basic_sanity_config2 test_check_timeout History
TopoTest 2.0 Branch
Skipped test_bgp_rfapi_basic_sanity_config2 test_cleanup_all History
TopoTest 2.0 Branch
Skipped test_bgp_rfapi_basic_sanity_config2 test_check_close History
TopoTest 2.0 Branch
Skipped test_bgp_rfapi_basic_sanity_config2 test_check_routes History
TopoTest 2.0 Branch
Skipped test_bgp_rfapi_basic_sanity_config2 test_adjacencies History
TopoTest 3.0 Branch
Skipped test_bgp_rfapi_basic_sanity_config2 test_check_routes History
TopoTest 3.0 Branch
Skipped test_bgp_rfapi_basic_sanity_config2 test_check_timeout History
TopoTest 3.0 Branch
Skipped test_bgp_rfapi_basic_sanity_config2 test_cleanup_all History
TopoTest 3.0 Branch
Skipped test_bgp_rfapi_basic_sanity_config2 test_check_close History
TopoTest 3.0 Branch
Skipped test_bgp_rfapi_basic_sanity_config2 test_add_routes History
TopoTest 3.0 Branch
Skipped test_bgp_rfapi_basic_sanity_config2 test_check_close History
TopoTest Master arm7
Skipped test_bgp_rfapi_basic_sanity_config2 test_adjacencies History
TopoTest Master arm7
Skipped test_bgp_rfapi_basic_sanity_config2 test_cleanup_all History
TopoTest Master arm7
Skipped test_bgp_rfapi_basic_sanity_config2 test_add_routes History
TopoTest Master arm7
Skipped test_bgp_rfapi_basic_sanity_config2 test_check_timeout History
TopoTest Master arm7
Skipped test_bgp_rfapi_basic_sanity_config2 test_check_routes History
TopoTest Master arm7
Skipped test_bgp_rfapi_basic_sanity test_adjacencies History
TopoTest 2.0 Branch
Skipped test_bgp_rfapi_basic_sanity test_cleanup_all History
TopoTest 2.0 Branch
Skipped test_bgp_rfapi_basic_sanity test_add_routes History
TopoTest 2.0 Branch
Skipped test_bgp_rfapi_basic_sanity test_check_timeout History
TopoTest 2.0 Branch
Skipped test_bgp_rfapi_basic_sanity test_check_routes History
TopoTest 2.0 Branch
Skipped test_bgp_rfapi_basic_sanity test_check_close History
TopoTest 2.0 Branch
Skipped test_bgp_rfapi_basic_sanity test_check_timeout History
TopoTest 3.0 Branch
Skipped test_bgp_rfapi_basic_sanity test_check_routes History
TopoTest 3.0 Branch
Skipped test_bgp_rfapi_basic_sanity test_check_close History
TopoTest 3.0 Branch
Skipped test_bgp_rfapi_basic_sanity test_add_routes History
TopoTest 3.0 Branch
Skipped test_bgp_rfapi_basic_sanity test_cleanup_all History
TopoTest 3.0 Branch
Skipped test_bgp_rfapi_basic_sanity test_adjacencies History
TopoTest 3.0 Branch
Skipped test_bgp_rfapi_basic_sanity test_check_routes History
TopoTest Master arm7
Skipped test_bgp_rfapi_basic_sanity test_check_timeout History
TopoTest Master arm7
Skipped test_bgp_rfapi_basic_sanity test_check_close History
TopoTest Master arm7
Skipped test_bgp_rfapi_basic_sanity test_adjacencies History
TopoTest Master arm7
Skipped test_bgp_rfapi_basic_sanity test_cleanup_all History
TopoTest Master arm7
Skipped test_bgp_rfapi_basic_sanity test_add_routes History
TopoTest Master arm7
Skipped test_bgp_vrf_netns_topo test_bgp_vrf_netns History
AddressSanitizer
Skipped test_bgp_vrf_netns_topo test_bgp_vrf_learn History
AddressSanitizer
Skipped test_bgp_vrf_netns_topo test_bgp_convergence History
AddressSanitizer
Skipped test_bgp_vrf_netns_topo test_bgp_vrf_learn History
TopoTest 2.0 Branch
Skipped test_bgp_vrf_netns_topo test_bgp_vrf_netns History
TopoTest 2.0 Branch
Skipped test_bgp_vrf_netns_topo test_bgp_convergence History
TopoTest 2.0 Branch