Testing PullReq against Topology Tests

Build: #386 failed Custom build by Github Hook with revision master

Build result summary

Details

Completed
Duration
52 minutes
Flags
Custom revisionCustom build
Labels
version=frr-6_1-dev-844-gdc079d4f7git=https_//github_com/frrouting/topotests_gitbuildurl=https_//ci1_netdef_org/browse/frr-topopr-cf-386branch=master
Revisions
FRR - Topotests
master master
FRR - FreeRangeRouting
dc079d4f7a311f5876f84f606cb2cd199783922d dc079d4f7a311f5876f84f606cb2cd199783922d
Total tests
1240
Failing since
#381 (Custom build by Github Hook with revision master)
Fixed in
#391 (Custom build by Github Hook with revision master)

Custom variables

Custom revision
master master
Name Value
github_base_sha 512010d4e54e38189ca553a20e088614516a70ec
github_pullreq 144
github_branch master
github_repo FRRouting/topotests
github_merge_sha 848b280842c0fe002bd9dd70887c29f5fcaf6978

Comments

  1. Github Hook

    GitHub Merge Request 144
    for GitHub Repo FRRouting/topotests, branch master

    Request to merge from FRRouting/topotests
    Merge Git Commit ID 848b280842c0fe002bd9dd70887c29f5fcaf6978 on top of base Git Commit ID 512010d4e54e38189ca553a20e088614516a70ec

Code commits

FRR - Topotests
Author Commit Message Commit date
Martin Winter Martin Winter 512010d4e54e38189ca553a20e088614516a70ec 512010d4e54e38189ca553a20e088614516a70ec Merge pull request #143 from opensourcerouting/bgp-ecmp-default-fix
bgp-ecmp-topo1: fix and improve topology test

Tests

New test failures 13
Status Test View job Duration
Collapse Failed test_bgp_ecmp_topo1 test_bgp_convergence History
AddressSanitizer 1 min
AssertionError: BGP router network did not converge assert json["ipv4Unicast"]["vrfName"] value is different (   --- Expected value   +++ Current value   @@ -1 +1 @@   -"Default"   +"default")
E   AssertionError: BGP router network did not converge
    assert json["ipv4Unicast"]["vrfName"] value is different (
      --- Expected value
      +++ Current value
      @@ -1 +1 @@
      -"Default"
      +"default")
Collapse Failed test_bgp_ecmp_topo1 test_bgp_convergence History
TopoTest Master amd64 54 secs
AssertionError: BGP router network did not converge assert json["ipv4Unicast"]["vrfName"] value is different (   --- Expected value   +++ Current value   @@ -1 +1 @@   -"Default"   +"default")
E   AssertionError: BGP router network did not converge
    assert json["ipv4Unicast"]["vrfName"] value is different (
      --- Expected value
      +++ Current value
      @@ -1 +1 @@
      -"Default"
      +"default")
Collapse Failed test_bgp_ecmp_topo1 test_bgp_convergence History
TopoTest Master arm7 1 min
AssertionError: BGP router network did not converge assert json["ipv4Unicast"]["vrfName"] value is different (   --- Expected value   +++ Current value   @@ -1 +1 @@   -"Default"   +"default")
E   AssertionError: BGP router network did not converge
    assert json["ipv4Unicast"]["vrfName"] value is different (
      --- Expected value
      +++ Current value
      @@ -1 +1 @@
      -"Default"
      +"default")
Collapse Failed test_bgp_ecmp_topo1 test_bgp_convergence History
TopoTest Master arm8 1 min
AssertionError: BGP router network did not converge assert json["ipv4Unicast"]["vrfName"] value is different (   --- Expected value   +++ Current value   @@ -1 +1 @@   -"Default"   +"default")
E   AssertionError: BGP router network did not converge
    assert json["ipv4Unicast"]["vrfName"] value is different (
      --- Expected value
      +++ Current value
      @@ -1 +1 @@
      -"Default"
      +"default")
Collapse Failed test_bgp_ecmp_topo1 test_bgp_convergence History
TopoTest Master i386 56 secs
AssertionError: BGP router network did not converge assert json["ipv4Unicast"]["vrfName"] value is different (   --- Expected value   +++ Current value   @@ -1 +1 @@   -"Default"   +"default")
E   AssertionError: BGP router network did not converge
    assert json["ipv4Unicast"]["vrfName"] value is different (
      --- Expected value
      +++ Current value
      @@ -1 +1 @@
      -"Default"
      +"default")
Collapse Failed test_bgp_l3vpn_to_bgp_direct test_adjacencies History
TopoTest Master arm7 1 min
AssertionError: 3 tests failed
E   AssertionError: 3 tests failed
Collapse Failed test_bgp_rfapi_basic_sanity_config2 test_adjacencies History
TopoTest Master arm7 1 min
AssertionError: 3 tests failed
E   AssertionError: 3 tests failed
Collapse Failed test_bgp_rfapi_basic_sanity test_adjacencies History
TopoTest Master arm7 1 min
AssertionError: 3 tests failed
E   AssertionError: 3 tests failed
Collapse Failed test_ldp_topo1 test_zebra_ipv4_routingTable History
TopoTest Master arm7 1 sec
AssertionError: IPv4 Zebra Routing Table verification failed for router r2:   --- actual IPv4 zebra routing table   +++ expected IPv4 zebra routing table   @@ -1,6 +1,6 @@    O>* 1.1.1.1/32 [110/10] via 10.0.1.1, r2-eth0, label implicit-null    O   2.2.2.2/32 [110/0] is directly connected, lo   -O>  3.3.3.3/32 [110/10] via 10.0.2.3, r2-eth1   +O>* 3.3.3.3/32 [110/10] via 10.0.2.3, r2-eth1, label implicit-null    O>* 4.4.4.4/32 [110/10] via 10.0.2.4, r2-eth1, label implicit-null    O   10.0.1.0/24 [110/10] is directly connected, r2-eth0    O   10.0.2.0/24 [110/10] is directly connected, r2-eth1 assert 1 == 0
E   AssertionError: IPv4 Zebra Routing Table verification failed for router r2:
      --- actual IPv4 zebra routing table
      +++ expected IPv4 zebra routing table
      @@ -1,6 +1,6 @@
       O>* 1.1.1.1/32 [110/10] via 10.0.1.1, r2-eth0, label implicit-null
       O   2.2.2.2/32 [110/0] is directly connected, lo
      -O>  3.3.3.3/32 [110/10] via 10.0.2.3, r2-eth1
(5 more lines...)
Collapse Failed test_ldp_topo1 test_mpls_table History
TopoTest Master arm7 2 secs
AssertionError: MPLS table output for router r2:   --- actual MPLS table output   +++ expected MPLS table output   @@ -2,5 +2,6 @@       Label     Type          Nexthop     Label    --------  -------  ---------------  --------          XX      LDP         10.0.1.1  implicit-null   +      XX      LDP         10.0.2.3  implicit-null          XX      LDP         10.0.2.4  implicit-null          XX      LDP         10.0.3.3  implicit-null assert 1 == 0
E   AssertionError: MPLS table output for router r2:
      --- actual MPLS table output
      +++ expected MPLS table output
      @@ -2,5 +2,6 @@
          Label     Type          Nexthop     Label
       --------  -------  ---------------  --------
             XX      LDP         10.0.1.1  implicit-null
(4 more lines...)
Collapse Failed test_ldp_topo1 test_linux_mpls_routes History
TopoTest Master arm7 < 1 sec
AssertionError: Linux Kernel MPLS route output for router r2:   --- actual Linux Kernel MPLS route   +++ expected Linux Kernel MPLS route   @@ -1,3 +1,3 @@   +xx proto xx nexthopvia inet 10.0.2.3 dev r2-eth1 nexthopvia inet 10.0.3.3 dev r2-eth2    xx via inet 10.0.1.1 dev r2-eth0 proto xx    xx via inet 10.0.2.4 dev r2-eth1 proto xx   -xx via inet 10.0.3.3 dev r2-eth2 proto xx assert 1 == 0
E   AssertionError: Linux Kernel MPLS route output for router r2:
      --- actual Linux Kernel MPLS route
      +++ expected Linux Kernel MPLS route
      @@ -1,3 +1,3 @@
      +xx proto xx nexthopvia inet 10.0.2.3 dev r2-eth1 nexthopvia inet 10.0.3.3 dev r2-eth2
       xx via inet 10.0.1.1 dev r2-eth0 proto xx
       xx via inet 10.0.2.4 dev r2-eth1 proto xx
(2 more lines...)
Collapse Failed test_ldp_topo1 test_mpls_ldp_binding History
TopoTest Master arm7 1 sec
AssertionError: MPLS LDP Interface binding output for router r2:   --- actual MPLS LDP binding output   +++ expected MPLS LDP binding output   @@ -1,5 +1,6 @@    AF   Destination          Nexthop         Local Label Remote Label  In Use    ipv4 1.1.1.1/32           1.1.1.1         xxx         imp-null         yes   +ipv4 1.1.1.1/32           3.3.3.3         xxx         xxx               no    ipv4 1.1.1.1/32           4.4.4.4         xxx         xxx               no    ipv4 2.2.2.2/32           1.1.1.1         imp-null    xxx               no    ipv4 2.2.2.2/32           3.3.3.3         imp-null    xxx               no assert 1 == 0
E   AssertionError: MPLS LDP Interface binding output for router r2:
      --- actual MPLS LDP binding output
      +++ expected MPLS LDP binding output
      @@ -1,5 +1,6 @@
       AF   Destination          Nexthop         Local Label Remote Label  In Use
       ipv4 1.1.1.1/32           1.1.1.1         xxx         imp-null         yes
      +ipv4 1.1.1.1/32           3.3.3.3         xxx         xxx               no
(4 more lines...)
Collapse Failed test_ldp_vpls_topo1 test_rib History
TopoTest Master arm7 3 mins
AssertionError: "r1" JSON output mismatches the expected result assert json value is different (   --- Expected value   +++ Current value   @@ -3,0 +4,2 @@   +        "internalFlags": 16,    +        "internalStatus": 2,    @@ -9 +11 @@   -                "fib": true,    +                "flags": 1,    @@ -17 +19 @@   -                "fib": true,    +                "flags": 1,    @@ -25 +27,2 @@   -        "selected": true   +        "selected": true,    +        "uptime": "00:04:00")
E   AssertionError: "r1" JSON output mismatches the expected result
    assert json value is different (
      --- Expected value
      +++ Current value
      @@ -3,0 +4,2 @@
      +        "internalFlags": 16, 
      +        "internalStatus": 2, 
(10 more lines...)

Shared artifacts

Artifact File size
VersionInfo 784 bytes
SourceCode 4 MB
topotests 541 KB