Testing PullReq against Topology Tests

Build: #387 failed Custom build by Github Hook with revision master

Test results

  • 1,240 tests in total
  • 2 tests failed
  • 2 failures are new
  • 205 tests were quarantined / skipped
  • 222 minutes taken in total.
New test failures 2
Status Test View job Duration
Collapse Failed test_bgp_vrf_netns_topo test_bgp_vrf_netns History
AddressSanitizer 3 secs
test teardown failure
E   AssertionError: 
    r1: Daemon zebra killed by AddressSanitizer
Collapse Failed test_ldp_vpls_topo1 test_ldp_bindings History
TopoTest Master arm8 2 mins
AssertionError: "r1" JSON output mismatches the expected result assert json value is different (   --- Expected value   +++ Current value   @@ -8 +8 @@   -        "remoteLabel": "17"   +        "remoteLabel": "18"   @@ -16 +16 @@   -        "remoteLabel": "16"   +        "remoteLabel": "17"   @@ -32 +32 @@   -        "remoteLabel": "17"   +        "remoteLabel": "16"   @@ -40 +40 @@   -        "remoteLabel": "18"   +        "remoteLabel": "17")
E   AssertionError: "r1" JSON output mismatches the expected result
    assert json value is different (
      --- Expected value
      +++ Current value
      @@ -8 +8 @@
      -        "remoteLabel": "17"
      +        "remoteLabel": "18"
(9 more lines...)
Skipped tests 100
Status Test Failing since View job
Skipped test_all_protocol_startup test_shutdown_check_stderr History
AddressSanitizer
Skipped test_all_protocol_startup test_mpls_interfaces History
TopoTest Master arm7
Skipped test_bfd_topo1 test_bfd_fast_convergence History
TopoTest 2.0 Branch
Skipped test_bfd_topo1 test_bgp_convergence History
TopoTest 2.0 Branch
Skipped test_bfd_topo1 test_bgp_fast_reconvergence History
TopoTest 2.0 Branch
Skipped test_bfd_topo1 test_bgp_fast_convergence History
TopoTest 2.0 Branch
Skipped test_bfd_topo1 test_memory_leak History
TopoTest 2.0 Branch
Skipped test_bfd_topo1 test_bfd_connection History
TopoTest 2.0 Branch
Skipped test_bfd_topo1 test_bfd_fast_convergence History
TopoTest 3.0 Branch
Skipped test_bfd_topo1 test_bgp_fast_convergence History
TopoTest 3.0 Branch
Skipped test_bfd_topo1 test_bgp_fast_reconvergence History
TopoTest 3.0 Branch
Skipped test_bfd_topo1 test_memory_leak History
TopoTest 3.0 Branch
Skipped test_bfd_topo1 test_bgp_convergence History
TopoTest 3.0 Branch
Skipped test_bfd_topo1 test_bfd_connection History
TopoTest 3.0 Branch
Skipped test_bfd_topo1 test_bgp_convergence History
TopoTest 4.0 Branch
Skipped test_bfd_topo1 test_memory_leak History
TopoTest 4.0 Branch
Skipped test_bfd_topo1 test_bfd_connection History
TopoTest 4.0 Branch
Skipped test_bfd_topo1 test_bgp_fast_reconvergence History
TopoTest 4.0 Branch
Skipped test_bfd_topo1 test_bgp_fast_convergence History
TopoTest 4.0 Branch
Skipped test_bfd_topo1 test_bfd_fast_convergence History
TopoTest 4.0 Branch
Skipped test_bfd_topo1 test_bfd_fast_convergence History
TopoTest 5.0 Branch
Skipped test_bfd_topo1 test_bgp_convergence History
TopoTest 5.0 Branch
Skipped test_bfd_topo1 test_bgp_fast_reconvergence History
TopoTest 5.0 Branch
Skipped test_bfd_topo1 test_bgp_fast_convergence History
TopoTest 5.0 Branch
Skipped test_bfd_topo1 test_bfd_connection History
TopoTest 5.0 Branch
Skipped test_bfd_topo1 test_memory_leak History
TopoTest 5.0 Branch
Skipped test_bgp_l3vpn_to_bgp_direct test_add_routes History
TopoTest 2.0 Branch
Skipped test_bgp_l3vpn_to_bgp_direct test_adjacencies History
TopoTest 2.0 Branch
Skipped test_bgp_l3vpn_to_bgp_direct test_check_routes History
TopoTest 2.0 Branch
Skipped test_bgp_l3vpn_to_bgp_direct test_cleanup_all History
TopoTest 2.0 Branch
Skipped test_bgp_l3vpn_to_bgp_direct test_adjacencies History
TopoTest 3.0 Branch
Skipped test_bgp_l3vpn_to_bgp_direct test_add_routes History
TopoTest 3.0 Branch
Skipped test_bgp_l3vpn_to_bgp_direct test_check_routes History
TopoTest 3.0 Branch
Skipped test_bgp_l3vpn_to_bgp_direct test_cleanup_all History
TopoTest 3.0 Branch
Skipped test_bgp_l3vpn_to_bgp_vrf test_check_linux_mpls History
AddressSanitizer
Skipped test_bgp_l3vpn_to_bgp_vrf test_check_linux_vrf History
AddressSanitizer
Skipped test_bgp_l3vpn_to_bgp_vrf test_check_linux_vrf History
TopoTest 2.0 Branch
Skipped test_bgp_l3vpn_to_bgp_vrf test_check_routes History
TopoTest 2.0 Branch
Skipped test_bgp_l3vpn_to_bgp_vrf test_adjacencies History
TopoTest 2.0 Branch
Skipped test_bgp_l3vpn_to_bgp_vrf test_check_linux_mpls History
TopoTest 2.0 Branch
Skipped test_bgp_l3vpn_to_bgp_vrf test_check_routes History
TopoTest 3.0 Branch
Skipped test_bgp_l3vpn_to_bgp_vrf test_check_linux_mpls History
TopoTest 3.0 Branch
Skipped test_bgp_l3vpn_to_bgp_vrf test_check_linux_vrf History
TopoTest 3.0 Branch
Skipped test_bgp_l3vpn_to_bgp_vrf test_adjacencies History
TopoTest 3.0 Branch
Skipped test_bgp_l3vpn_to_bgp_vrf test_check_linux_vrf History
TopoTest 4.0 Branch
Skipped test_bgp_l3vpn_to_bgp_vrf test_check_routes History
TopoTest 4.0 Branch
Skipped test_bgp_l3vpn_to_bgp_vrf test_check_linux_mpls History
TopoTest 4.0 Branch
Skipped test_bgp_l3vpn_to_bgp_vrf test_adjacencies History
TopoTest 4.0 Branch
Skipped test_bgp_l3vpn_to_bgp_vrf test_check_linux_vrf History
TopoTest 5.0 Branch
Skipped test_bgp_l3vpn_to_bgp_vrf test_check_linux_mpls History
TopoTest 5.0 Branch
Skipped test_bgp_l3vpn_to_bgp_vrf test_check_linux_vrf History
TopoTest 6.0 Branch
Skipped test_bgp_l3vpn_to_bgp_vrf test_check_linux_mpls History
TopoTest 6.0 Branch
Skipped test_bgp_l3vpn_to_bgp_vrf test_check_linux_mpls History
TopoTest Master amd64
Skipped test_bgp_l3vpn_to_bgp_vrf test_check_linux_vrf History
TopoTest Master amd64
Skipped test_bgp_l3vpn_to_bgp_vrf test_check_linux_vrf History
TopoTest Master i386
Skipped test_bgp_l3vpn_to_bgp_vrf test_check_linux_mpls History
TopoTest Master i386
Skipped test_bgp_multiview_topo1 test_shutdown_check_stderr History
AddressSanitizer
Skipped test_bgp_rfapi_basic_sanity_config2 test_adjacencies History
TopoTest 2.0 Branch
Skipped test_bgp_rfapi_basic_sanity_config2 test_cleanup_all History
TopoTest 2.0 Branch
Skipped test_bgp_rfapi_basic_sanity_config2 test_add_routes History
TopoTest 2.0 Branch
Skipped test_bgp_rfapi_basic_sanity_config2 test_check_timeout History
TopoTest 2.0 Branch
Skipped test_bgp_rfapi_basic_sanity_config2 test_check_close History
TopoTest 2.0 Branch
Skipped test_bgp_rfapi_basic_sanity_config2 test_check_routes History
TopoTest 2.0 Branch
Skipped test_bgp_rfapi_basic_sanity_config2 test_check_timeout History
TopoTest 3.0 Branch
Skipped test_bgp_rfapi_basic_sanity_config2 test_check_routes History
TopoTest 3.0 Branch
Skipped test_bgp_rfapi_basic_sanity_config2 test_add_routes History
TopoTest 3.0 Branch
Skipped test_bgp_rfapi_basic_sanity_config2 test_check_close History
TopoTest 3.0 Branch
Skipped test_bgp_rfapi_basic_sanity_config2 test_adjacencies History
TopoTest 3.0 Branch
Skipped test_bgp_rfapi_basic_sanity_config2 test_cleanup_all History
TopoTest 3.0 Branch
Skipped test_bgp_rfapi_basic_sanity_config2 test_adjacencies History
TopoTest Master arm7
Skipped test_bgp_rfapi_basic_sanity_config2 test_check_close History
TopoTest Master arm7
Skipped test_bgp_rfapi_basic_sanity_config2 test_cleanup_all History
TopoTest Master arm7
Skipped test_bgp_rfapi_basic_sanity_config2 test_add_routes History
TopoTest Master arm7
Skipped test_bgp_rfapi_basic_sanity_config2 test_check_timeout History
TopoTest Master arm7
Skipped test_bgp_rfapi_basic_sanity_config2 test_check_routes History
TopoTest Master arm7
Skipped test_bgp_rfapi_basic_sanity test_check_timeout History
TopoTest 2.0 Branch
Skipped test_bgp_rfapi_basic_sanity test_add_routes History
TopoTest 2.0 Branch
Skipped test_bgp_rfapi_basic_sanity test_cleanup_all History
TopoTest 2.0 Branch
Skipped test_bgp_rfapi_basic_sanity test_check_routes History
TopoTest 2.0 Branch
Skipped test_bgp_rfapi_basic_sanity test_adjacencies History
TopoTest 2.0 Branch
Skipped test_bgp_rfapi_basic_sanity test_check_close History
TopoTest 2.0 Branch
Skipped test_bgp_rfapi_basic_sanity test_check_close History
TopoTest 3.0 Branch
Skipped test_bgp_rfapi_basic_sanity test_check_timeout History
TopoTest 3.0 Branch
Skipped test_bgp_rfapi_basic_sanity test_add_routes History
TopoTest 3.0 Branch
Skipped test_bgp_rfapi_basic_sanity test_check_routes History
TopoTest 3.0 Branch
Skipped test_bgp_rfapi_basic_sanity test_cleanup_all History
TopoTest 3.0 Branch
Skipped test_bgp_rfapi_basic_sanity test_adjacencies History
TopoTest 3.0 Branch
Skipped test_bgp_rfapi_basic_sanity test_check_timeout History
TopoTest Master arm7
Skipped test_bgp_rfapi_basic_sanity test_check_close History
TopoTest Master arm7
Skipped test_bgp_rfapi_basic_sanity test_adjacencies History
TopoTest Master arm7
Skipped test_bgp_rfapi_basic_sanity test_cleanup_all History
TopoTest Master arm7
Skipped test_bgp_rfapi_basic_sanity test_add_routes History
TopoTest Master arm7
Skipped test_bgp_rfapi_basic_sanity test_check_routes History
TopoTest Master arm7
Skipped test_bgp_vrf_netns_topo test_bgp_convergence History
TopoTest 2.0 Branch
Skipped test_bgp_vrf_netns_topo test_bgp_vrf_learn History
TopoTest 2.0 Branch
Skipped test_bgp_vrf_netns_topo test_bgp_vrf_netns History
TopoTest 2.0 Branch
Skipped test_bgp_vrf_netns_topo test_bgp_convergence History
TopoTest 3.0 Branch
Skipped test_bgp_vrf_netns_topo test_bgp_vrf_netns History
TopoTest 3.0 Branch
Skipped test_bgp_vrf_netns_topo test_bgp_vrf_learn History
TopoTest 3.0 Branch
Skipped test_bgp_vrf_netns_topo test_bgp_vrf_netns History
TopoTest 4.0 Branch