Testing PullReq against Topology Tests

Build: #394 failed Custom build by Github Hook with revision master

Build result summary

Details

Completed
Duration
39 minutes
Flags
Custom revisionCustom build
Labels
version=frr-6_1-dev-905-g6c241117fgit=https_//github_com/frrouting/topotests_gitbuildurl=https_//ci1_netdef_org/browse/frr-topopr-cf-394branch=master
Revisions
FRR - Topotests
master master
FRR - FreeRangeRouting
6c241117f87ca07afbae23a03c3a7ca59b1fce78 6c241117f87ca07afbae23a03c3a7ca59b1fce78
Total tests
1240

Custom variables

Custom revision
master master
Name Value
github_base_sha 302a1697dcb74c6b4e5308721c77af469268e7ce
github_pullreq 146
github_branch master
github_repo FRRouting/topotests
github_merge_sha b8268d7d9d9bb447475c1d3e90d26df25a328377

Comments

  1. Github Hook

    GitHub Merge Request 146
    for GitHub Repo FRRouting/topotests, branch master

    Request to merge from adharkar/topotests
    Merge Git Commit ID b8268d7d9d9bb447475c1d3e90d26df25a328377 on top of base Git Commit ID 302a1697dcb74c6b4e5308721c77af469268e7ce

Code commits

FRR - Topotests
Author Commit Message Commit date
Rafael Zalamena <rzalamena@users.noreply.github.com> Rafael Zalamena <rzalamena@users.noreply.github.com> 302a1697dcb74c6b4e5308721c77af469268e7ce 302a1697dcb74c6b4e5308721c77af469268e7ce Merge pull request #145 from donaldsharp/staticd_warning
Add a tiny breadcrumb to hopefully help end user
FRR - FreeRangeRouting
Author Commit Message Commit date
Russ White <russ@riw.us> Russ White <russ@riw.us> 6c241117f87ca07afbae23a03c3a7ca59b1fce78 6c241117f87ca07afbae23a03c3a7ca59b1fce78 Merge pull request #3373 from nitinsoniism/show_evpn_arp_cache_vni_all_detail
zebra: Add "show evpn arp-cache vni all detail" command
Russ White <russ@riw.us> Russ White <russ@riw.us> 4fedcc69476f5e35e1f5c344e6ae13eca922ade6 4fedcc69476f5e35e1f5c344e6ae13eca922ade6 Merge pull request #3267 from mjstapp/dplane_3
zebra async dataplane: phase 2
Nitin Soni <nsoni@cumulusnetworks.com> Nitin Soni <nsoni@cumulusnetworks.com> e3fac9195d98fbbc8de1c83e47e701b0fa750132 e3fac9195d98fbbc8de1c83e47e701b0fa750132 zebra: Add "show evpn arp-cache vni all detail" command
Change helps display detailed output for all possible VNI neighbors
without specifying VNI and ip. It helps in troubleshooting as a single
command can be fired to capture detailed info on all VNIs.

Ticket: CM-22832
Signed-off-by: Nitin Soni <nsoni@cumulusnetworks.com>
Reviewed-by: CCR-8034
Russ White <russ@riw.us> Russ White <russ@riw.us> 98d8359fe710f08753a337911b04612da5218b2b 98d8359fe710f08753a337911b04612da5218b2b Merge pull request #3351 from chiragshah6/ospfv3_dev
ospf6d: abr summary advertise best route

Tests

New test failures 9
Status Test View job Duration
Collapse Failed test_bgp_l3vpn_to_bgp_direct test_adjacencies History
TopoTest Master arm7 1 min
AssertionError: 3 tests failed
E   AssertionError: 3 tests failed
Collapse Failed test_bgp_rfapi_basic_sanity_config2 test_adjacencies History
TopoTest Master arm7 1 min
AssertionError: 3 tests failed
E   AssertionError: 3 tests failed
Collapse Failed test_bgp_rfapi_basic_sanity test_adjacencies History
TopoTest Master arm7 1 min
AssertionError: 3 tests failed
E   AssertionError: 3 tests failed
Collapse Failed test_bgp_vrf_netns_topo test_bgp_vrf_netns History
AddressSanitizer 3 secs
test teardown failure
E   AssertionError: 
    r1: Daemon zebra killed by AddressSanitizer
Collapse Failed test_ldp_topo1 test_linux_mpls_routes History
TopoTest Master arm7 < 1 sec
AssertionError: Linux Kernel MPLS route output for router r2:   --- actual Linux Kernel MPLS route   +++ expected Linux Kernel MPLS route   @@ -1,3 +1,3 @@   +xx proto xx nexthopvia inet 10.0.2.3 dev r2-eth1 nexthopvia inet 10.0.3.3 dev r2-eth2    xx via inet 10.0.1.1 dev r2-eth0 proto xx    xx via inet 10.0.2.4 dev r2-eth1 proto xx   -xx via inet 10.0.3.3 dev r2-eth2 proto xx assert 1 == 0
E   AssertionError: Linux Kernel MPLS route output for router r2:
      --- actual Linux Kernel MPLS route
      +++ expected Linux Kernel MPLS route
      @@ -1,3 +1,3 @@
      +xx proto xx nexthopvia inet 10.0.2.3 dev r2-eth1 nexthopvia inet 10.0.3.3 dev r2-eth2
       xx via inet 10.0.1.1 dev r2-eth0 proto xx
       xx via inet 10.0.2.4 dev r2-eth1 proto xx
(2 more lines...)
Collapse Failed test_ldp_topo1 test_mpls_ldp_binding History
TopoTest Master arm7 3 secs
AssertionError: MPLS LDP Interface binding output for router r4:   --- actual MPLS LDP binding output   +++ expected MPLS LDP binding output   @@ -12,4 +12,4 @@    ipv4 10.0.2.0/24          2.2.2.2         imp-null    imp-null          no    ipv4 10.0.2.0/24          3.3.3.3         imp-null    imp-null          no    ipv4 10.0.3.0/24          2.2.2.2         xxx         imp-null         yes   -ipv4 10.0.3.0/24          3.3.3.3         xxx         imp-null          no   +ipv4 10.0.3.0/24          3.3.3.3         xxx         imp-null         yes assert 1 == 0
E   AssertionError: MPLS LDP Interface binding output for router r4:
      --- actual MPLS LDP binding output
      +++ expected MPLS LDP binding output
      @@ -12,4 +12,4 @@
       ipv4 10.0.2.0/24          2.2.2.2         imp-null    imp-null          no
       ipv4 10.0.2.0/24          3.3.3.3         imp-null    imp-null          no
       ipv4 10.0.3.0/24          2.2.2.2         xxx         imp-null         yes
(3 more lines...)
Collapse Failed test_ldp_topo1 test_zebra_ipv4_routingTable History
TopoTest Master arm7 1 sec
AssertionError: IPv4 Zebra Routing Table verification failed for router r2:   --- actual IPv4 zebra routing table   +++ expected IPv4 zebra routing table   @@ -1,6 +1,6 @@    O>* 1.1.1.1/32 [110/10] via 10.0.1.1, r2-eth0, label implicit-null    O   2.2.2.2/32 [110/0] is directly connected, lo   -O>  3.3.3.3/32 [110/10] via 10.0.2.3, r2-eth1   +O>* 3.3.3.3/32 [110/10] via 10.0.2.3, r2-eth1, label implicit-null    O>* 4.4.4.4/32 [110/10] via 10.0.2.4, r2-eth1, label implicit-null    O   10.0.1.0/24 [110/10] is directly connected, r2-eth0    O   10.0.2.0/24 [110/10] is directly connected, r2-eth1 assert 1 == 0
E   AssertionError: IPv4 Zebra Routing Table verification failed for router r2:
      --- actual IPv4 zebra routing table
      +++ expected IPv4 zebra routing table
      @@ -1,6 +1,6 @@
       O>* 1.1.1.1/32 [110/10] via 10.0.1.1, r2-eth0, label implicit-null
       O   2.2.2.2/32 [110/0] is directly connected, lo
      -O>  3.3.3.3/32 [110/10] via 10.0.2.3, r2-eth1
(5 more lines...)
Collapse Failed test_ldp_topo1 test_mpls_table History
TopoTest Master arm7 2 secs
AssertionError: MPLS table output for router r2:   --- actual MPLS table output   +++ expected MPLS table output   @@ -2,5 +2,6 @@       Label     Type          Nexthop     Label    --------  -------  ---------------  --------          XX      LDP         10.0.1.1  implicit-null   +      XX      LDP         10.0.2.3  implicit-null          XX      LDP         10.0.2.4  implicit-null          XX      LDP         10.0.3.3  implicit-null assert 1 == 0
E   AssertionError: MPLS table output for router r2:
      --- actual MPLS table output
      +++ expected MPLS table output
      @@ -2,5 +2,6 @@
          Label     Type          Nexthop     Label
       --------  -------  ---------------  --------
             XX      LDP         10.0.1.1  implicit-null
(4 more lines...)
Collapse Failed test_ldp_vpls_topo1 test_rib History
TopoTest Master arm7 3 mins
AssertionError: "r1" JSON output mismatches the expected result assert json value is different (   --- Expected value   +++ Current value   @@ -3,0 +4,2 @@   +        "internalFlags": 16,    +        "internalStatus": 2,    @@ -9 +11 @@   -                "fib": true,    +                "flags": 1,    @@ -17 +19 @@   -                "fib": true,    +                "flags": 1,    @@ -25 +27,2 @@   -        "selected": true   +        "selected": true,    +        "uptime": "00:04:02")
E   AssertionError: "r1" JSON output mismatches the expected result
    assert json value is different (
      --- Expected value
      +++ Current value
      @@ -3,0 +4,2 @@
      +        "internalFlags": 16, 
      +        "internalStatus": 2, 
(10 more lines...)

Shared artifacts

Artifact File size
VersionInfo 784 bytes
SourceCode 4 MB
topotests 535 KB