Testing PullReq against Topology Tests

Build: #395 failed Custom build by Github Hook with revision master

Test results

  • 620 tests in total
  • 5 tests failed
  • 5 failures are new
  • 147 tests were quarantined / skipped
  • 91 minutes taken in total.
New test failures 5
Status Test View job Duration
Collapse Failed test_all_protocol_startup test_router_running History
TopoTest 2.0 Branch 8 secs
AssertionError: r1: Daemon isisd not running assert 'r1: Daemon isisd not running' == ''   - r1: Daemon isisd not running
E   AssertionError: r1: Daemon isisd not running
    assert 'r1: Daemon isisd not running' == ''
      - r1: Daemon isisd not running
Collapse Failed test_all_protocol_startup test_bgp_ipv6_summary History
TopoTest 3.0 Branch < 1 sec
AssertionError: SHOW BGP IPv6 SUMMARY failed for router r1:   --- actual SHOW BGP IPv6 SUMMARY   +++ expected SHOW BGP IPv6 SUMMARY   @@ -1,7 +1,7 @@    BGP router identifier 192.168.0.1, local AS number 100 vrf-id 0    BGP table version 1    RIB entries 1, using XXXX bytes of memory   -Peers 4, using XXXX KiB of memory   +Peers 2, using XXXX KiB of memory        Neighbor         V         AS MsgRcvd MsgSent   TblVer  InQ OutQ  Up/Down State/PfxRcd    fc00:0:0:8::1000 4        100       0       0        0    0    0    never       Active assert 1 == 0   -1   +0
E   AssertionError: SHOW BGP IPv6 SUMMARY failed for router r1:
      --- actual SHOW BGP IPv6 SUMMARY
      +++ expected SHOW BGP IPv6 SUMMARY
      @@ -1,7 +1,7 @@
       BGP router identifier 192.168.0.1, local AS number 100 vrf-id 0
       BGP table version 1
       RIB entries 1, using XXXX bytes of memory
(8 more lines...)
Collapse Failed test_all_protocol_startup test_bgp_ipv6_summary History
TopoTest 4.0 Branch < 1 sec
AssertionError: SHOW BGP IPv6 SUMMARY failed for router r1:   --- actual SHOW BGP IPv6 SUMMARY   +++ expected SHOW BGP IPv6 SUMMARY   @@ -1,7 +1,7 @@    BGP router identifier 192.168.0.1, local AS number 100 vrf-id 0    BGP table version 1    RIB entries 1, using XXXX bytes of memory   -Peers 4, using XXXX KiB of memory   +Peers 2, using XXXX KiB of memory        Neighbor         V         AS MsgRcvd MsgSent   TblVer  InQ OutQ  Up/Down State/PfxRcd    fc00:0:0:8::1000 4        100       0       0        0    0    0    never       Active assert 1 == 0   -1   +0
E   AssertionError: SHOW BGP IPv6 SUMMARY failed for router r1:
      --- actual SHOW BGP IPv6 SUMMARY
      +++ expected SHOW BGP IPv6 SUMMARY
      @@ -1,7 +1,7 @@
       BGP router identifier 192.168.0.1, local AS number 100 vrf-id 0
       BGP table version 1
       RIB entries 1, using XXXX bytes of memory
(8 more lines...)
Collapse Failed test_all_protocol_startup test_bgp_ipv6_summary History
TopoTest 5.0 Branch < 1 sec
AssertionError: SHOW BGP IPv6 SUMMARY failed for router r1:   --- actual SHOW BGP IPv6 SUMMARY   +++ expected SHOW BGP IPv6 SUMMARY   @@ -1,7 +1,7 @@    BGP router identifier 192.168.0.1, local AS number 100 vrf-id 0    BGP table version 1    RIB entries 1, using XXXX bytes of memory   -Peers 4, using XXXX KiB of memory   +Peers 2, using XXXX KiB of memory        Neighbor         V         AS MsgRcvd MsgSent   TblVer  InQ OutQ  Up/Down State/PfxRcd    fc00:0:0:8::1000 4        100       0       0        0    0    0    never       Active assert 1 == 0   -1   +0
E   AssertionError: SHOW BGP IPv6 SUMMARY failed for router r1:
      --- actual SHOW BGP IPv6 SUMMARY
      +++ expected SHOW BGP IPv6 SUMMARY
      @@ -1,7 +1,7 @@
       BGP router identifier 192.168.0.1, local AS number 100 vrf-id 0
       BGP table version 1
       RIB entries 1, using XXXX bytes of memory
(8 more lines...)
Collapse Failed test_all_protocol_startup test_bgp_ipv6_summary History
TopoTest 6.0 Branch < 1 sec
AssertionError: SHOW BGP IPv6 SUMMARY failed for router r1:   --- actual SHOW BGP IPv6 SUMMARY   +++ expected SHOW BGP IPv6 SUMMARY   @@ -1,7 +1,7 @@    BGP router identifier 192.168.0.1, local AS number 100 vrf-id 0    BGP table version 1    RIB entries 1, using XXXX bytes of memory   -Peers 4, using XXXX KiB of memory   +Peers 2, using XXXX KiB of memory        Neighbor         V         AS MsgRcvd MsgSent   TblVer  InQ OutQ  Up/Down State/PfxRcd    fc00:0:0:8::1000 4        100       0       0        0    0    0    never       Active assert 1 == 0   -1   +0
E   AssertionError: SHOW BGP IPv6 SUMMARY failed for router r1:
      --- actual SHOW BGP IPv6 SUMMARY
      +++ expected SHOW BGP IPv6 SUMMARY
      @@ -1,7 +1,7 @@
       BGP router identifier 192.168.0.1, local AS number 100 vrf-id 0
       BGP table version 1
       RIB entries 1, using XXXX bytes of memory
(8 more lines...)
Skipped tests 100
Status Test Failing since View job
Skipped test_all_protocol_startup test_error_messages_vtysh History
TopoTest 2.0 Branch
Skipped test_all_protocol_startup test_ospfv2_interfaces History
TopoTest 2.0 Branch
Skipped test_all_protocol_startup test_bgp_ipv6 History
TopoTest 2.0 Branch
Skipped test_all_protocol_startup test_ripng_status History
TopoTest 2.0 Branch
Skipped test_all_protocol_startup test_rip_status History
TopoTest 2.0 Branch
Skipped test_all_protocol_startup test_isis_interfaces History
TopoTest 2.0 Branch
Skipped test_all_protocol_startup test_mpls_interfaces History
TopoTest 2.0 Branch
Skipped test_all_protocol_startup test_shutdown_check_memleak History
TopoTest 2.0 Branch
Skipped test_all_protocol_startup test_bgp_summary History
TopoTest 2.0 Branch
Skipped test_all_protocol_startup test_converge_protocols History
TopoTest 2.0 Branch
Skipped test_all_protocol_startup test_shutdown_check_stderr History
TopoTest 2.0 Branch
Skipped test_all_protocol_startup test_bgp_ipv6_summary History
TopoTest 2.0 Branch
Skipped test_all_protocol_startup test_bgp_ipv4 History
TopoTest 2.0 Branch
Skipped test_all_protocol_startup test_error_messages_daemons History
TopoTest 2.0 Branch
Skipped test_bfd_topo1 test_bgp_convergence History
TopoTest 2.0 Branch
Skipped test_bfd_topo1 test_bfd_fast_convergence History
TopoTest 2.0 Branch
Skipped test_bfd_topo1 test_bgp_fast_reconvergence History
TopoTest 2.0 Branch
Skipped test_bfd_topo1 test_memory_leak History
TopoTest 2.0 Branch
Skipped test_bfd_topo1 test_bgp_fast_convergence History
TopoTest 2.0 Branch
Skipped test_bfd_topo1 test_bfd_connection History
TopoTest 2.0 Branch
Skipped test_bfd_topo1 test_bfd_fast_convergence History
TopoTest 3.0 Branch
Skipped test_bfd_topo1 test_bgp_fast_convergence History
TopoTest 3.0 Branch
Skipped test_bfd_topo1 test_bgp_convergence History
TopoTest 3.0 Branch
Skipped test_bfd_topo1 test_bfd_connection History
TopoTest 3.0 Branch
Skipped test_bfd_topo1 test_bgp_fast_reconvergence History
TopoTest 3.0 Branch
Skipped test_bfd_topo1 test_memory_leak History
TopoTest 3.0 Branch
Skipped test_bfd_topo1 test_bgp_convergence History
TopoTest 4.0 Branch
Skipped test_bfd_topo1 test_bgp_fast_reconvergence History
TopoTest 4.0 Branch
Skipped test_bfd_topo1 test_bgp_fast_convergence History
TopoTest 4.0 Branch
Skipped test_bfd_topo1 test_memory_leak History
TopoTest 4.0 Branch
Skipped test_bfd_topo1 test_bfd_connection History
TopoTest 4.0 Branch
Skipped test_bfd_topo1 test_bfd_fast_convergence History
TopoTest 4.0 Branch
Skipped test_bfd_topo1 test_bfd_fast_convergence History
TopoTest 5.0 Branch
Skipped test_bfd_topo1 test_memory_leak History
TopoTest 5.0 Branch
Skipped test_bfd_topo1 test_bgp_fast_convergence History
TopoTest 5.0 Branch
Skipped test_bfd_topo1 test_bgp_fast_reconvergence History
TopoTest 5.0 Branch
Skipped test_bfd_topo1 test_bgp_convergence History
TopoTest 5.0 Branch
Skipped test_bfd_topo1 test_bfd_connection History
TopoTest 5.0 Branch
Skipped test_bgp_l3vpn_to_bgp_direct test_check_routes History
TopoTest 2.0 Branch
Skipped test_bgp_l3vpn_to_bgp_direct test_add_routes History
TopoTest 2.0 Branch
Skipped test_bgp_l3vpn_to_bgp_direct test_cleanup_all History
TopoTest 2.0 Branch
Skipped test_bgp_l3vpn_to_bgp_direct test_adjacencies History
TopoTest 2.0 Branch
Skipped test_bgp_l3vpn_to_bgp_direct test_cleanup_all History
TopoTest 3.0 Branch
Skipped test_bgp_l3vpn_to_bgp_direct test_check_routes History
TopoTest 3.0 Branch
Skipped test_bgp_l3vpn_to_bgp_direct test_add_routes History
TopoTest 3.0 Branch
Skipped test_bgp_l3vpn_to_bgp_direct test_adjacencies History
TopoTest 3.0 Branch
Skipped test_bgp_l3vpn_to_bgp_vrf test_check_routes History
TopoTest 2.0 Branch
Skipped test_bgp_l3vpn_to_bgp_vrf test_check_linux_vrf History
TopoTest 2.0 Branch
Skipped test_bgp_l3vpn_to_bgp_vrf test_adjacencies History
TopoTest 2.0 Branch
Skipped test_bgp_l3vpn_to_bgp_vrf test_check_linux_mpls History
TopoTest 2.0 Branch
Skipped test_bgp_l3vpn_to_bgp_vrf test_check_linux_vrf History
TopoTest 3.0 Branch
Skipped test_bgp_l3vpn_to_bgp_vrf test_adjacencies History
TopoTest 3.0 Branch
Skipped test_bgp_l3vpn_to_bgp_vrf test_check_linux_mpls History
TopoTest 3.0 Branch
Skipped test_bgp_l3vpn_to_bgp_vrf test_check_routes History
TopoTest 3.0 Branch
Skipped test_bgp_l3vpn_to_bgp_vrf test_adjacencies History
TopoTest 4.0 Branch
Skipped test_bgp_l3vpn_to_bgp_vrf test_check_linux_vrf History
TopoTest 4.0 Branch
Skipped test_bgp_l3vpn_to_bgp_vrf test_check_routes History
TopoTest 4.0 Branch
Skipped test_bgp_l3vpn_to_bgp_vrf test_check_linux_mpls History
TopoTest 4.0 Branch
Skipped test_bgp_l3vpn_to_bgp_vrf test_check_linux_mpls History
TopoTest 5.0 Branch
Skipped test_bgp_l3vpn_to_bgp_vrf test_check_linux_vrf History
TopoTest 5.0 Branch
Skipped test_bgp_l3vpn_to_bgp_vrf test_check_linux_vrf History
TopoTest 6.0 Branch
Skipped test_bgp_l3vpn_to_bgp_vrf test_check_linux_mpls History
TopoTest 6.0 Branch
Skipped test_bgp_rfapi_basic_sanity_config2 test_check_routes History
TopoTest 2.0 Branch
Skipped test_bgp_rfapi_basic_sanity_config2 test_check_timeout History
TopoTest 2.0 Branch
Skipped test_bgp_rfapi_basic_sanity_config2 test_cleanup_all History
TopoTest 2.0 Branch
Skipped test_bgp_rfapi_basic_sanity_config2 test_adjacencies History
TopoTest 2.0 Branch
Skipped test_bgp_rfapi_basic_sanity_config2 test_add_routes History
TopoTest 2.0 Branch
Skipped test_bgp_rfapi_basic_sanity_config2 test_check_close History
TopoTest 2.0 Branch
Skipped test_bgp_rfapi_basic_sanity_config2 test_check_timeout History
TopoTest 3.0 Branch
Skipped test_bgp_rfapi_basic_sanity_config2 test_check_routes History
TopoTest 3.0 Branch
Skipped test_bgp_rfapi_basic_sanity_config2 test_check_close History
TopoTest 3.0 Branch
Skipped test_bgp_rfapi_basic_sanity_config2 test_adjacencies History
TopoTest 3.0 Branch
Skipped test_bgp_rfapi_basic_sanity_config2 test_cleanup_all History
TopoTest 3.0 Branch
Skipped test_bgp_rfapi_basic_sanity_config2 test_add_routes History
TopoTest 3.0 Branch
Skipped test_bgp_rfapi_basic_sanity test_cleanup_all History
TopoTest 2.0 Branch
Skipped test_bgp_rfapi_basic_sanity test_adjacencies History
TopoTest 2.0 Branch
Skipped test_bgp_rfapi_basic_sanity test_check_timeout History
TopoTest 2.0 Branch
Skipped test_bgp_rfapi_basic_sanity test_check_close History
TopoTest 2.0 Branch
Skipped test_bgp_rfapi_basic_sanity test_check_routes History
TopoTest 2.0 Branch
Skipped test_bgp_rfapi_basic_sanity test_add_routes History
TopoTest 2.0 Branch
Skipped test_bgp_rfapi_basic_sanity test_add_routes History
TopoTest 3.0 Branch
Skipped test_bgp_rfapi_basic_sanity test_cleanup_all History
TopoTest 3.0 Branch
Skipped test_bgp_rfapi_basic_sanity test_adjacencies History
TopoTest 3.0 Branch
Skipped test_bgp_rfapi_basic_sanity test_check_close History
TopoTest 3.0 Branch
Skipped test_bgp_rfapi_basic_sanity test_check_timeout History
TopoTest 3.0 Branch
Skipped test_bgp_rfapi_basic_sanity test_check_routes History
TopoTest 3.0 Branch
Skipped test_bgp_vrf_netns_topo test_bgp_vrf_netns History
TopoTest 2.0 Branch
Skipped test_bgp_vrf_netns_topo test_bgp_convergence History
TopoTest 2.0 Branch
Skipped test_bgp_vrf_netns_topo test_bgp_vrf_learn History
TopoTest 2.0 Branch
Skipped test_bgp_vrf_netns_topo test_bgp_vrf_netns History
TopoTest 3.0 Branch
Skipped test_bgp_vrf_netns_topo test_bgp_vrf_learn History
TopoTest 3.0 Branch
Skipped test_bgp_vrf_netns_topo test_bgp_convergence History
TopoTest 3.0 Branch
Skipped test_bgp_vrf_netns_topo test_bgp_vrf_netns History
TopoTest 4.0 Branch
Skipped test_bgp_vrf_netns_topo test_bgp_convergence History
TopoTest 4.0 Branch
Skipped test_bgp_vrf_netns_topo test_bgp_vrf_learn History
TopoTest 4.0 Branch
Skipped test_eigrp_topo1 test_eigrp_routes History
TopoTest 2.0 Branch
Skipped test_eigrp_topo1 test_shutdown_check_stderr History
TopoTest 2.0 Branch
Skipped test_eigrp_topo1 test_converge_protocols History
TopoTest 2.0 Branch
Skipped test_eigrp_topo1 test_zebra_ipv4_routingTable History
TopoTest 2.0 Branch
Skipped test_eigrp_topo1 test_zebra_ipv4_routingTable History
TopoTest 3.0 Branch