RTRLIB-Pull-Request Testing

Build: #80 failed Custom build by Github Hook with revision master

Logs

The following logs have been generated by the jobs in this plan.
  • Expand all
  • Collapse all
Job Logs
Collapse CentOS 6 AMD64 Building Stage Download or View
08-Feb-2019 09:47:54 4/8 Test #4: test_ht_spkitable_locks ..........   Passed    1.10 sec
08-Feb-2019 09:47:54     Start 5: test_live_validation
08-Feb-2019 09:48:14 5/8 Test #5: test_live_validation .............***Failed   20.01 sec
08-Feb-2019 09:48:14     Start 6: test_ipaddr
08-Feb-2019 09:48:14 6/8 Test #6: test_ipaddr ......................   Passed    0.01 sec
08-Feb-2019 09:48:14     Start 7: test_getbits
08-Feb-2019 09:48:14 7/8 Test #7: test_getbits .....................   Passed    0.00 sec
08-Feb-2019 09:48:14     Start 8: test_dynamic_groups
08-Feb-2019 09:48:34 8/8 Test #8: test_dynamic_groups ..............***Failed   20.01 sec
08-Feb-2019 09:48:34
08-Feb-2019 09:48:34 75% tests passed, 2 tests failed out of 8
08-Feb-2019 09:48:34
08-Feb-2019 09:48:34 Total Test time (real) =  44.58 sec
08-Feb-2019 09:48:34
08-Feb-2019 09:48:34 The following tests FAILED:
08-Feb-2019 09:48:34           5 - test_live_validation (Failed)
08-Feb-2019 09:48:34           8 - test_dynamic_groups (Failed)
08-Feb-2019 09:48:34 Errors while running CTest
08-Feb-2019 09:48:34 make: *** [test] Error 8
08-Feb-2019 09:48:34 make test (Debug) failed
08-Feb-2019 09:48:37 Domain ci206_centos6_amd64 is being shutdown
08-Feb-2019 09:48:37
08-Feb-2019 09:48:39 VM ci206_centos6_amd64 is not yet shut off. Current State:          running
08-Feb-2019 09:48:39 -> sleeping 5s (35 attempts left to try again before failing)
08-Feb-2019 09:48:47 Unable to publish artifact [CentOS 6 x86_64 Packages]: the source directory /home/bamboo/bamboo/xml-data/build-dir/30441531/RPKI-RTRLIBPR-CENTOS6AMD64/pkg does not exist.
Collapse CentOS 7 AMD64 Building Stage Download or View
08-Feb-2019 09:47:54 4/8 Test #4: test_ht_spkitable_locks ..........   Passed    0.68 sec
08-Feb-2019 09:47:54     Start 5: test_live_validation
08-Feb-2019 09:48:14 5/8 Test #5: test_live_validation .............***Failed   20.01 sec
08-Feb-2019 09:48:14     Start 6: test_ipaddr
08-Feb-2019 09:48:14 6/8 Test #6: test_ipaddr ......................   Passed    0.01 sec
08-Feb-2019 09:48:14     Start 7: test_getbits
08-Feb-2019 09:48:14 7/8 Test #7: test_getbits .....................   Passed    0.00 sec
08-Feb-2019 09:48:14     Start 8: test_dynamic_groups
08-Feb-2019 09:48:34 8/8 Test #8: test_dynamic_groups ..............***Failed   20.01 sec
08-Feb-2019 09:48:34
08-Feb-2019 09:48:34 75% tests passed, 2 tests failed out of 8
08-Feb-2019 09:48:34
08-Feb-2019 09:48:34 Total Test time (real) =  44.07 sec
08-Feb-2019 09:48:34
08-Feb-2019 09:48:34 The following tests FAILED:
08-Feb-2019 09:48:34           5 - test_live_validation (Failed)
08-Feb-2019 09:48:34           8 - test_dynamic_groups (Failed)
08-Feb-2019 09:48:34 Errors while running CTest
08-Feb-2019 09:48:34 make: *** [test] Error 8
08-Feb-2019 09:48:34 make test (Debug) failed
08-Feb-2019 09:48:37 Domain ci205_centos7_amd64 is being shutdown
08-Feb-2019 09:48:37
08-Feb-2019 09:48:39 VM ci205_centos7_amd64 is not yet shut off. Current State:          running
08-Feb-2019 09:48:39 -> sleeping 5s (35 attempts left to try again before failing)
08-Feb-2019 09:48:47 Unable to publish artifact [CentOS 7 x86_64 Packages]: the source directory /home/bamboo/bamboo/xml-data/build-dir/30441530/RPKI-RTRLIBPR-CENTOS7AMD64/pkg does not exist.
Collapse Debian 8 AMD64 Building Stage Download or View
08-Feb-2019 09:47:44     Start 4: test_ht_spkitable_locks
08-Feb-2019 09:47:45 4/8 Test #4: test_ht_spkitable_locks ..........   Passed    1.30 sec
08-Feb-2019 09:47:45     Start 5: test_live_validation
08-Feb-2019 09:48:05 5/8 Test #5: test_live_validation .............***Failed   20.01 sec
08-Feb-2019 09:48:05     Start 6: test_ipaddr
08-Feb-2019 09:48:05 6/8 Test #6: test_ipaddr ......................   Passed    0.00 sec
08-Feb-2019 09:48:05     Start 7: test_getbits
08-Feb-2019 09:48:05 7/8 Test #7: test_getbits .....................   Passed    0.00 sec
08-Feb-2019 09:48:05     Start 8: test_dynamic_groups
08-Feb-2019 09:48:25 8/8 Test #8: test_dynamic_groups ..............***Failed   20.01 sec
08-Feb-2019 09:48:25
08-Feb-2019 09:48:25 75% tests passed, 2 tests failed out of 8
08-Feb-2019 09:48:25
08-Feb-2019 09:48:25 Total Test time (real) =  44.98 sec
08-Feb-2019 09:48:25
08-Feb-2019 09:48:25 The following tests FAILED:
08-Feb-2019 09:48:25           5 - test_live_validation (Failed)
08-Feb-2019 09:48:25           8 - test_dynamic_groups (Failed)
08-Feb-2019 09:48:25 Errors while running CTest
08-Feb-2019 09:48:25 Makefile:117: recipe for target 'test' failed
08-Feb-2019 09:48:25 make: *** [test] Error 8
08-Feb-2019 09:48:25 make test (Debug) failed
08-Feb-2019 09:48:31 Domain ci108_debian8_amd64 is being shutdown
08-Feb-2019 09:48:31
08-Feb-2019 09:48:32 Unable to publish artifact [Debian 8 x86_64 Packages]: the source directory /home/bamboo/bamboo/xml-data/build-dir/30441519/RPKI-RTRLIBPR-DEBIAN8AMD64/pkg does not exist.
Collapse Debian 9 AMD64 Building Stage Download or View
08-Feb-2019 09:47:41     Start 4: test_ht_spkitable_locks
08-Feb-2019 09:47:43 4/8 Test #4: test_ht_spkitable_locks ..........   Passed    1.41 sec
08-Feb-2019 09:47:43     Start 5: test_live_validation
08-Feb-2019 09:48:03 5/8 Test #5: test_live_validation .............***Failed   20.01 sec
08-Feb-2019 09:48:03     Start 6: test_ipaddr
08-Feb-2019 09:48:03 6/8 Test #6: test_ipaddr ......................   Passed    0.00 sec
08-Feb-2019 09:48:03     Start 7: test_getbits
08-Feb-2019 09:48:03 7/8 Test #7: test_getbits .....................   Passed    0.00 sec
08-Feb-2019 09:48:03     Start 8: test_dynamic_groups
08-Feb-2019 09:48:23 8/8 Test #8: test_dynamic_groups ..............***Failed   20.01 sec
08-Feb-2019 09:48:23
08-Feb-2019 09:48:23 75% tests passed, 2 tests failed out of 8
08-Feb-2019 09:48:23
08-Feb-2019 09:48:23 Total Test time (real) =  45.29 sec
08-Feb-2019 09:48:23
08-Feb-2019 09:48:23 The following tests FAILED:
08-Feb-2019 09:48:23           5 - test_live_validation (Failed)
08-Feb-2019 09:48:23           8 - test_dynamic_groups (Failed)
08-Feb-2019 09:48:23 Errors while running CTest
08-Feb-2019 09:48:23 Makefile:127: recipe for target 'test' failed
08-Feb-2019 09:48:23 make: *** [test] Error 8
08-Feb-2019 09:48:23 make test (Debug) failed
08-Feb-2019 09:48:25 Domain ci021_debian9_amd64 is being shutdown
08-Feb-2019 09:48:25
08-Feb-2019 09:48:28 Unable to publish artifact [Debian 9 x86_64 Packages]: the source directory /home/bamboo/bamboo/xml-data/build-dir/38010881/RPKI-RTRLIBPR-DEBIAN9AMD64/pkg does not exist.
Collapse Debian 9 arm7 Building Stage Download or View
08-Feb-2019 09:48:40     Start 8: test_dynamic_groups
08-Feb-2019 09:49:00 8/8 Test #8: test_dynamic_groups ..............***Failed   20.02 sec
08-Feb-2019 09:49:00
08-Feb-2019 09:49:00 75% tests passed, 2 tests failed out of 8
08-Feb-2019 09:49:00
08-Feb-2019 09:49:00 Total Test time (real) =  66.14 sec
08-Feb-2019 09:49:00
08-Feb-2019 09:49:00 The following tests FAILED:
08-Feb-2019 09:49:00           5 - test_live_validation (Failed)
08-Feb-2019 09:49:00           8 - test_dynamic_groups (Failed)
08-Feb-2019 09:49:00 Errors while running CTest
08-Feb-2019 09:49:00 Makefile:116: recipe for target 'test' failed
08-Feb-2019 09:49:00 make: *** [test] Error 8
08-Feb-2019 09:49:00 make test (Debug) failed
08-Feb-2019 09:49:06 Reading package lists...
08-Feb-2019 09:49:07 Building dependency tree...
08-Feb-2019 09:49:07 Reading state information...
08-Feb-2019 09:49:09 Reading package lists...
08-Feb-2019 09:49:10 Building dependency tree...
08-Feb-2019 09:49:10 Reading state information...
08-Feb-2019 09:49:12 Reading package lists...
08-Feb-2019 09:49:13 Building dependency tree...
08-Feb-2019 09:49:13 Reading state information...
08-Feb-2019 09:49:15 Lock on physical node removed
08-Feb-2019 09:49:15 Unable to publish artifact [Debian 9 arm7 Packages]: the source directory /root/bamboo-agent-home/xml-data/build-dir/RPKI-RTRLIBPR-D9BUILDARM7/pkg does not exist.
Collapse Debian 9 arm8 Building Stage Download or View
08-Feb-2019 09:48:04     Start 8: test_dynamic_groups
08-Feb-2019 09:48:24 8/8 Test #8: test_dynamic_groups ..............***Failed   20.01 sec
08-Feb-2019 09:48:24
08-Feb-2019 09:48:24 75% tests passed, 2 tests failed out of 8
08-Feb-2019 09:48:24
08-Feb-2019 09:48:24 Total Test time (real) =  59.47 sec
08-Feb-2019 09:48:24
08-Feb-2019 09:48:24 The following tests FAILED:
08-Feb-2019 09:48:24           5 - test_live_validation (Failed)
08-Feb-2019 09:48:24           8 - test_dynamic_groups (Failed)
08-Feb-2019 09:48:24 Errors while running CTest
08-Feb-2019 09:48:24 Makefile:127: recipe for target 'test' failed
08-Feb-2019 09:48:24 make: *** [test] Error 8
08-Feb-2019 09:48:24 make test (Debug) failed
08-Feb-2019 09:48:28 Reading package lists...
08-Feb-2019 09:48:29 Building dependency tree...
08-Feb-2019 09:48:29 Reading state information...
08-Feb-2019 09:48:31 Reading package lists...
08-Feb-2019 09:48:31 Building dependency tree...
08-Feb-2019 09:48:31 Reading state information...
08-Feb-2019 09:48:33 Reading package lists...
08-Feb-2019 09:48:33 Building dependency tree...
08-Feb-2019 09:48:33 Reading state information...
08-Feb-2019 09:48:34 Lock on physical node removed
08-Feb-2019 09:48:34 Unable to publish artifact [Debian 9 arm8 Packages]: the source directory /root/bamboo-agent-home/xml-data/build-dir/RPKI-RTRLIBPR-D9BUILDARM8/pkg does not exist.
Collapse Fedora 24 AMD64 Building Stage Download or View
08-Feb-2019 09:47:38 3/8 Test #3: test_ht_spkitable ................   Passed    2.29 sec
08-Feb-2019 09:47:38     Start 4: test_ht_spkitable_locks
08-Feb-2019 09:47:39 4/8 Test #4: test_ht_spkitable_locks ..........   Passed    0.78 sec
08-Feb-2019 09:47:39     Start 5: test_live_validation
08-Feb-2019 09:47:54 5/8 Test #5: test_live_validation .............   Passed   15.12 sec
08-Feb-2019 09:47:54     Start 6: test_ipaddr
08-Feb-2019 09:47:54 6/8 Test #6: test_ipaddr ......................   Passed    0.01 sec
08-Feb-2019 09:47:54     Start 7: test_getbits
08-Feb-2019 09:47:54 7/8 Test #7: test_getbits .....................   Passed    0.00 sec
08-Feb-2019 09:47:54     Start 8: test_dynamic_groups
08-Feb-2019 09:48:14 8/8 Test #8: test_dynamic_groups ..............***Failed   20.01 sec
08-Feb-2019 09:48:14
08-Feb-2019 09:48:14 88% tests passed, 1 tests failed out of 8
08-Feb-2019 09:48:14
08-Feb-2019 09:48:14 Total Test time (real) =  39.46 sec
08-Feb-2019 09:48:14
08-Feb-2019 09:48:14 The following tests FAILED:
08-Feb-2019 09:48:14           8 - test_dynamic_groups (Failed)
08-Feb-2019 09:48:14 Errors while running CTest
08-Feb-2019 09:48:14 Makefile:129: recipe for target 'test' failed
08-Feb-2019 09:48:14 make: *** [test] Error 8
08-Feb-2019 09:48:14 make test (Debug) failed
08-Feb-2019 09:48:18 Domain ci215_fedora24_amd64 is being shutdown
08-Feb-2019 09:48:18
08-Feb-2019 09:48:23 Unable to publish artifact [Fedora 24 x86_64 Packages]: the source directory /home/bamboo/bamboo/xml-data/build-dir/30441537/RPKI-RTRLIBPR-FEDORA24AMD64/pkg does not exist.
Collapse Fedora 29 AMD64 Building Stage Download or View
08-Feb-2019 09:47:40 3/8 Test #3: test_ht_spkitable ................   Passed    1.81 sec
08-Feb-2019 09:47:40     Start 4: test_ht_spkitable_locks
08-Feb-2019 09:47:41 4/8 Test #4: test_ht_spkitable_locks ..........   Passed    0.62 sec
08-Feb-2019 09:47:41     Start 5: test_live_validation
08-Feb-2019 09:48:01 5/8 Test #5: test_live_validation .............***Failed   20.01 sec
08-Feb-2019 09:48:01     Start 6: test_ipaddr
08-Feb-2019 09:48:01 6/8 Test #6: test_ipaddr ......................   Passed    0.01 sec
08-Feb-2019 09:48:01     Start 7: test_getbits
08-Feb-2019 09:48:01 7/8 Test #7: test_getbits .....................   Passed    0.00 sec
08-Feb-2019 09:48:01     Start 8: test_dynamic_groups
08-Feb-2019 09:48:21 8/8 Test #8: test_dynamic_groups ..............***Failed   20.01 sec
08-Feb-2019 09:48:21
08-Feb-2019 09:48:21 75% tests passed, 2 tests failed out of 8
08-Feb-2019 09:48:21
08-Feb-2019 09:48:21 Total Test time (real) =  43.79 sec
08-Feb-2019 09:48:21
08-Feb-2019 09:48:21 The following tests FAILED:
08-Feb-2019 09:48:21           5 - test_live_validation (Failed)
08-Feb-2019 09:48:21           8 - test_dynamic_groups (Failed)
08-Feb-2019 09:48:21 Errors while running CTest
08-Feb-2019 09:48:21 make: *** [Makefile:119: test] Error 8
08-Feb-2019 09:48:21 make test (Debug) failed
08-Feb-2019 09:48:23 Domain ci115_fedora29_amd64 is being shutdown
08-Feb-2019 09:48:23
08-Feb-2019 09:48:26 Unable to publish artifact [Fedora 29 x86_64 Packages]: the source directory /home/bamboo/bamboo/xml-data/build-dir/30441523/RPKI-RTRLIBPR-FEDORA29AMD64/pkg does not exist.
Collapse Ubuntu 14.04 AMD64 Building Stage Download or View
08-Feb-2019 09:47:43 3/8 Test #3: test_ht_spkitable ................   Passed    1.97 sec
08-Feb-2019 09:47:43     Start 4: test_ht_spkitable_locks
08-Feb-2019 09:47:43 4/8 Test #4: test_ht_spkitable_locks ..........   Passed    0.68 sec
08-Feb-2019 09:47:43     Start 5: test_live_validation
08-Feb-2019 09:48:03 5/8 Test #5: test_live_validation .............***Failed   20.01 sec
08-Feb-2019 09:48:03     Start 6: test_ipaddr
08-Feb-2019 09:48:03 6/8 Test #6: test_ipaddr ......................   Passed    0.00 sec
08-Feb-2019 09:48:03     Start 7: test_getbits
08-Feb-2019 09:48:03 7/8 Test #7: test_getbits .....................   Passed    0.00 sec
08-Feb-2019 09:48:03     Start 8: test_dynamic_groups
08-Feb-2019 09:48:23 8/8 Test #8: test_dynamic_groups ..............***Failed   20.01 sec
08-Feb-2019 09:48:23
08-Feb-2019 09:48:23 75% tests passed, 2 tests failed out of 8
08-Feb-2019 09:48:23
08-Feb-2019 09:48:23 Total Test time (real) =  43.94 sec
08-Feb-2019 09:48:23
08-Feb-2019 09:48:23 The following tests FAILED:
08-Feb-2019 09:48:23           5 - test_live_validation (Failed)
08-Feb-2019 09:48:23           8 - test_dynamic_groups (Failed)
08-Feb-2019 09:48:23 Errors while running CTest
08-Feb-2019 09:48:23 make: *** [test] Error 8
08-Feb-2019 09:48:23 make test (Debug) failed
08-Feb-2019 09:48:26 Domain ci101_ubuntu1404_amd64 is being shutdown
08-Feb-2019 09:48:26
08-Feb-2019 09:48:32 Unable to publish artifact [Ubuntu 14.04 x86_64 Packages]: the source directory /home/bamboo/bamboo/xml-data/build-dir/30441512/RPKI-RTRLIBPR-UBUNTU1404AMD64/pkg does not exist.
Collapse Ubuntu 16.04 AMD64 Building Stage Download or View
08-Feb-2019 09:47:44     Start 4: test_ht_spkitable_locks
08-Feb-2019 09:47:46 4/8 Test #4: test_ht_spkitable_locks ..........   Passed    1.39 sec
08-Feb-2019 09:47:46     Start 5: test_live_validation
08-Feb-2019 09:48:06 5/8 Test #5: test_live_validation .............***Failed   20.01 sec
08-Feb-2019 09:48:06     Start 6: test_ipaddr
08-Feb-2019 09:48:06 6/8 Test #6: test_ipaddr ......................   Passed    0.00 sec
08-Feb-2019 09:48:06     Start 7: test_getbits
08-Feb-2019 09:48:06 7/8 Test #7: test_getbits .....................   Passed    0.00 sec
08-Feb-2019 09:48:06     Start 8: test_dynamic_groups
08-Feb-2019 09:48:26 8/8 Test #8: test_dynamic_groups ..............***Failed   20.00 sec
08-Feb-2019 09:48:26
08-Feb-2019 09:48:26 75% tests passed, 2 tests failed out of 8
08-Feb-2019 09:48:26
08-Feb-2019 09:48:26 Total Test time (real) =  45.21 sec
08-Feb-2019 09:48:26
08-Feb-2019 09:48:26 The following tests FAILED:
08-Feb-2019 09:48:26           5 - test_live_validation (Failed)
08-Feb-2019 09:48:26           8 - test_dynamic_groups (Failed)
08-Feb-2019 09:48:26 Errors while running CTest
08-Feb-2019 09:48:26 Makefile:127: recipe for target 'test' failed
08-Feb-2019 09:48:26 make: *** [test] Error 8
08-Feb-2019 09:48:26 make test (Debug) failed
08-Feb-2019 09:48:28 Domain ci014_ubuntu1604_amd64 is being shutdown
08-Feb-2019 09:48:28
08-Feb-2019 09:48:31 Unable to publish artifact [Ubuntu 16.04 x86_64 Packages]: the source directory /home/bamboo/bamboo/xml-data/build-dir/15826958/RPKI-RTRLIBPR-UBUNTU1604AMD64/pkg does not exist.
Collapse Ubuntu 16.04 arm7 Building Stage Download or View
08-Feb-2019 09:49:02     Start 8: test_dynamic_groups
08-Feb-2019 09:49:22 8/8 Test #8: test_dynamic_groups ..............***Failed   20.02 sec
08-Feb-2019 09:49:22
08-Feb-2019 09:49:22 75% tests passed, 2 tests failed out of 8
08-Feb-2019 09:49:22
08-Feb-2019 09:49:22 Total Test time (real) =  67.56 sec
08-Feb-2019 09:49:22
08-Feb-2019 09:49:22 The following tests FAILED:
08-Feb-2019 09:49:22           5 - test_live_validation (Failed)
08-Feb-2019 09:49:22           8 - test_dynamic_groups (Failed)
08-Feb-2019 09:49:22 Errors while running CTest
08-Feb-2019 09:49:22 Makefile:116: recipe for target 'test' failed
08-Feb-2019 09:49:22 make: *** [test] Error 8
08-Feb-2019 09:49:22 make test (Debug) failed
08-Feb-2019 09:49:27 Reading package lists...
08-Feb-2019 09:49:28 Building dependency tree...
08-Feb-2019 09:49:28 Reading state information...
08-Feb-2019 09:49:30 Reading package lists...
08-Feb-2019 09:49:31 Building dependency tree...
08-Feb-2019 09:49:31 Reading state information...
08-Feb-2019 09:49:32 Reading package lists...
08-Feb-2019 09:49:33 Building dependency tree...
08-Feb-2019 09:49:33 Reading state information...
08-Feb-2019 09:49:35 Lock on physical node removed
08-Feb-2019 09:49:35 Unable to publish artifact [Ubuntu 16.04 arm7 Packages]: the source directory /root/bamboo-agent-home/xml-data/build-dir/RPKI-RTRLIBPR-UBUNTU1604ARM7/pkg does not exist.
Collapse Ubuntu 16.04 arm8 Building Stage Download or View
08-Feb-2019 09:48:05     Start 8: test_dynamic_groups
08-Feb-2019 09:48:25 8/8 Test #8: test_dynamic_groups ..............***Failed   20.01 sec
08-Feb-2019 09:48:25
08-Feb-2019 09:48:25 75% tests passed, 2 tests failed out of 8
08-Feb-2019 09:48:25
08-Feb-2019 09:48:25 Total Test time (real) =  59.29 sec
08-Feb-2019 09:48:25
08-Feb-2019 09:48:25 The following tests FAILED:
08-Feb-2019 09:48:25           5 - test_live_validation (Failed)
08-Feb-2019 09:48:25           8 - test_dynamic_groups (Failed)
08-Feb-2019 09:48:25 Errors while running CTest
08-Feb-2019 09:48:25 Makefile:127: recipe for target 'test' failed
08-Feb-2019 09:48:25 make: *** [test] Error 8
08-Feb-2019 09:48:25 make test (Debug) failed
08-Feb-2019 09:48:28 Reading package lists...
08-Feb-2019 09:48:29 Building dependency tree...
08-Feb-2019 09:48:29 Reading state information...
08-Feb-2019 09:48:29 Reading package lists...
08-Feb-2019 09:48:30 Building dependency tree...
08-Feb-2019 09:48:30 Reading state information...
08-Feb-2019 09:48:31 Reading package lists...
08-Feb-2019 09:48:32 Building dependency tree...
08-Feb-2019 09:48:32 Reading state information...
08-Feb-2019 09:48:32 Lock on physical node removed
08-Feb-2019 09:48:32 Unable to publish artifact [Ubuntu 16.04 arm8 Packages]: the source directory /root/bamboo-agent-home/xml-data/build-dir/RPKI-RTRLIBPR-UBUNTU1604ARM8/pkg does not exist.
Collapse Ubuntu 16.04 i386 Building Stage Download or View
08-Feb-2019 09:47:41     Start 4: test_ht_spkitable_locks
08-Feb-2019 09:47:41 4/8 Test #4: test_ht_spkitable_locks ..........   Passed    0.73 sec
08-Feb-2019 09:47:41     Start 5: test_live_validation
08-Feb-2019 09:48:01 5/8 Test #5: test_live_validation .............***Failed   20.01 sec
08-Feb-2019 09:48:01     Start 6: test_ipaddr
08-Feb-2019 09:48:01 6/8 Test #6: test_ipaddr ......................   Passed    0.00 sec
08-Feb-2019 09:48:01     Start 7: test_getbits
08-Feb-2019 09:48:01 7/8 Test #7: test_getbits .....................   Passed    0.00 sec
08-Feb-2019 09:48:01     Start 8: test_dynamic_groups
08-Feb-2019 09:48:21 8/8 Test #8: test_dynamic_groups ..............***Failed   20.01 sec
08-Feb-2019 09:48:21
08-Feb-2019 09:48:21 75% tests passed, 2 tests failed out of 8
08-Feb-2019 09:48:21
08-Feb-2019 09:48:21 Total Test time (real) =  44.50 sec
08-Feb-2019 09:48:21
08-Feb-2019 09:48:21 The following tests FAILED:
08-Feb-2019 09:48:21           5 - test_live_validation (Failed)
08-Feb-2019 09:48:21           8 - test_dynamic_groups (Failed)
08-Feb-2019 09:48:21 Errors while running CTest
08-Feb-2019 09:48:21 Makefile:116: recipe for target 'test' failed
08-Feb-2019 09:48:21 make: *** [test] Error 8
08-Feb-2019 09:48:21 make test (Debug) failed
08-Feb-2019 09:48:26 Domain ci209_ubuntu1604_i386 is being shutdown
08-Feb-2019 09:48:26
08-Feb-2019 09:48:31 Unable to publish artifact [Ubuntu 16.04 i386 Packages]: the source directory /home/bamboo/bamboo/xml-data/build-dir/34045985/RPKI-RTRLIBPR-UBUNTU1604I386/pkg does not exist.
Collapse Ubuntu 18.04 AMD64 Building Stage Download or View
08-Feb-2019 09:47:45     Start 4: test_ht_spkitable_locks
08-Feb-2019 09:47:46 4/8 Test #4: test_ht_spkitable_locks ..........   Passed    0.63 sec
08-Feb-2019 09:47:46     Start 5: test_live_validation
08-Feb-2019 09:48:06 5/8 Test #5: test_live_validation .............***Failed   20.01 sec
08-Feb-2019 09:48:06     Start 6: test_ipaddr
08-Feb-2019 09:48:06 6/8 Test #6: test_ipaddr ......................   Passed    0.00 sec
08-Feb-2019 09:48:06     Start 7: test_getbits
08-Feb-2019 09:48:06 7/8 Test #7: test_getbits .....................   Passed    0.00 sec
08-Feb-2019 09:48:06     Start 8: test_dynamic_groups
08-Feb-2019 09:48:26 8/8 Test #8: test_dynamic_groups ..............***Failed   20.01 sec
08-Feb-2019 09:48:28
08-Feb-2019 09:48:28 75% tests passed, 2 tests failed out of 8
08-Feb-2019 09:48:28
08-Feb-2019 09:48:28 Total Test time (real) =  43.84 sec
08-Feb-2019 09:48:28
08-Feb-2019 09:48:28 The following tests FAILED:
08-Feb-2019 09:48:28           5 - test_live_validation (Failed)
08-Feb-2019 09:48:28           8 - test_dynamic_groups (Failed)
08-Feb-2019 09:48:28 Makefile:118: recipe for target 'test' failed
08-Feb-2019 09:48:28 Errors while running CTest
08-Feb-2019 09:48:28 make: *** [test] Error 8
08-Feb-2019 09:48:28 make test (Debug) failed
08-Feb-2019 09:48:32 Domain ci222_ubuntu1804_amd64 is being shutdown
08-Feb-2019 09:48:32
08-Feb-2019 09:48:35 Unable to publish artifact [Ubuntu 18.04 x86_64 Packages]: the source directory /home/bamboo/bamboo/xml-data/build-dir/48726017/RPKI-RTRLIBPR-U1804AMD64/pkg does not exist.