Build: #5 failed Manual run by Pascal Kueng

Build result summary

Details

Completed
Duration
149 minutes
Labels
version=frr-7_4-dev-1318-ga6f1ad43fgit=https_//github_com/frrouting/frr_gitbuildurl=https_//ci1_netdef_org/browse/testing-frrpul-5branch=master
Revision
a6f1ad43f0939c2cbb6d68fd42b485eea520a144 a6f1ad43f0939c2cbb6d68fd42b485eea520a144
Total tests
3701
Failing since
#3 (Manual run by Pascal Kueng)

Responsible

Code commits

Author Commit Message Commit date
Mark Stapp <mjs@voltanet.io> Mark Stapp <mjs@voltanet.io> a6f1ad43f0939c2cbb6d68fd42b485eea520a144 a6f1ad43f0939c2cbb6d68fd42b485eea520a144 Merge pull request #6362 from donaldsharp/typedef_i_hatez_it
Typedef replacements
Donald Sharp Donald Sharp 67ceb408692a478db37bcd2c87ed9d0e37acbb3c 67ceb408692a478db37bcd2c87ed9d0e37acbb3c zebra: Remove typedef netlink_route_info_t
Signed-off-by: Donald Sharp <sharpd@cumulusnetworks.com>
Donald Sharp Donald Sharp 630d59624921744e0d43a71cd2778e5ea11a1df7 630d59624921744e0d43a71cd2778e5ea11a1df7 zebra: Remove typedef rib_table_info_t from system
Signed-off-by: Donald Sharp <sharpd@cumulusnetworks.com>
Donald Sharp Donald Sharp 91e6f25bc0ac835e2724a463e495f01cff5e04ea 91e6f25bc0ac835e2724a463e495f01cff5e04ea zebra: remove typedef rib_update_event_t from system
Signed-off-by: Donald Sharp <sharpd@cumulusnetworks.com>
Donald Sharp Donald Sharp f92155718692b89c60d483c378e59120628e9538 f92155718692b89c60d483c378e59120628e9538 zebra: Remove typedef rnh_type_t from system
Signed-off-by: Donald Sharp <sharpd@cumulusnetworks.com>

Configuration changes

Plan configuration has changed since the last successful build. See the plan audit log for more details.

Tests

New test failures 2
Status Test View job Duration
Collapse Failed test_bfd_bgp_cbit_topo3 test_bfd_loss_intermediate History
ThreadSanitizer Topotests Part 1 1 min
AssertionError: "r1" JSON output mismatches assert json value is different (   --- Expected value   +++ Current value   @@ -2,0 +3,3 @@   +        "detect-multiplier": 3,    +        "diagnostic": "control detection time expired",    +        "downtime": 15,    @@ -3,0 +7 @@   +        "id": 1161133051,    @@ -7,0 +12,2 @@   +        "remote-detect-multiplier": 3,    +        "remote-diagnostic": "control detection time expired",    @@ -9,4 +15,6 @@   -        "remote-receive-interval": 300,    -        "remote-transmit-interval": 300,    -        "status": "up",    -        "transmit-interval": 300   +        "remote-id": 0,    +        "remote-receive-interval": 1000,    +        "remote-transmit-interval": 1000,    +        "status": "down",    +        "transmit-interval": 300,    +        "vrf": "default")
E   AssertionError: "r1" JSON output mismatches
    assert json value is different (
      --- Expected value
      +++ Current value
      @@ -2,0 +3,3 @@
      +        "detect-multiplier": 3, 
      +        "diagnostic": "control detection time expired", 
(17 more lines...)
Collapse Failed test_bfd_bgp_cbit_topo3 test_bfd_loss_intermediate History
AddressSanitizer Topotests Part 1 43 secs
AssertionError: "r1" JSON output mismatches assert json value is different (   --- Expected value   +++ Current value   @@ -2,0 +3,3 @@   +        "detect-multiplier": 3,    +        "diagnostic": "control detection time expired",    +        "downtime": 6,    @@ -3,0 +7 @@   +        "id": 3705038372,    @@ -7,0 +12,2 @@   +        "remote-detect-multiplier": 3,    +        "remote-diagnostic": "control detection time expired",    @@ -9,4 +15,6 @@   -        "remote-receive-interval": 300,    -        "remote-transmit-interval": 300,    -        "status": "up",    -        "transmit-interval": 300   +        "remote-id": 0,    +        "remote-receive-interval": 1000,    +        "remote-transmit-interval": 1000,    +        "status": "down",    +        "transmit-interval": 300,    +        "vrf": "default")
E   AssertionError: "r1" JSON output mismatches
    assert json value is different (
      --- Expected value
      +++ Current value
      @@ -2,0 +3,3 @@
      +        "detect-multiplier": 3, 
      +        "diagnostic": "control detection time expired", 
(17 more lines...)
Existing test failures 2
Status Test Failing since View job Duration
AssertionError: 18 tests failed
E   AssertionError: 18 tests failed
AssertionError: 20 tests failed
E   AssertionError: 20 tests failed