FRR PR 8144 with Libyang2 branch by Chopps

Build: #8 failed Code changes detected

Stages & jobs

  1. Get Sourcecode

  2. Building Stage

  3. Basic Tests

  4. Final

    Final

Build result summary

Details

Completed
Duration
125 minutes
Labels
version=frr-7_4-dev-5467-g01316ad42git=https_//github_com/labnconsulting/frr_gitbuildurl=https_//ci1_netdef_org/browse/testing-libyang2chopps-8branch=chopps/ly2
Revision
01316ad423cedacfe130f10db047b366671b0120 01316ad423cedacfe130f10db047b366671b0120
Total tests
11301
Fixed in
#11 (Code changes detected)

Tests

Responsible

No one has taken responsibility for this failure

Code commits

Author Commit Message Commit date
Christian Hopps <chopps@gmail.com> Christian Hopps <chopps@gmail.com> 01316ad423cedacfe130f10db047b366671b0120 m 01316ad423cedacfe130f10db047b366671b0120 libyang: Updates libyang2 from review
Signed-off-by: Christian Hopps <chopps@labn.net>

Tests

New test failures 2
Status Test View job Duration
Collapse Failed test_bgp_auth test_multiple_vrf_prefix_peer_remove_passwords History
TopoTests Ubuntu 18.04 amd64 Part 1 2 mins
AssertionError: R2 could not peer 1.1.1.1 state expected Connect got Established  assert False == True   -False   +True
E   AssertionError: R2 could not peer 1.1.1.1 state expected Connect got Established 
    assert False == True
      -False
      +True
Collapse Failed test_isis_lfa_topo1 test_rib_ipv6_step8 History
TopoTests Ubuntu 16.04 i386 Part 7 1 min
AssertionError: "rt1" JSON output mismatches the expected result assert Generated JSON diff error report:      > $: d2 has key '2001:db8:1000::3/128' which is not present in d1   > $: d2 has key '2001:db8:1000::6/128' which is not present in d1   > $: d2 has key '2001:db8:1000::5/128' which is not present in d1   > $: d2 has key '2001:db8:1000::2/128' which is not present in d1   > $: d2 has key '2001:db8:1000::7/128' which is not present in d1   > $: d2 has key '2001:db8:1000::4/128' which is not present in d1
E   AssertionError: "rt1" JSON output mismatches the expected result
    assert Generated JSON diff error report:
      
      > $: d2 has key '2001:db8:1000::3/128' which is not present in d1
      > $: d2 has key '2001:db8:1000::6/128' which is not present in d1
      > $: d2 has key '2001:db8:1000::5/128' which is not present in d1
      > $: d2 has key '2001:db8:1000::2/128' which is not present in d1
(2 more lines...)