Topotest Debian 10

Build: #7 failed Manual run by Martin Winter

Build result summary

Details

Completed
Duration
107 minutes
Labels
version=frr-7_4-dev-5276-gc3ac2e549git=https_//github_com/frrouting/frr_gitbuildurl=https_//ci1_netdef_org/browse/testing-topo10deb10-7branch=master
Revision
c3ac2e54981067ec1b83720252f202dc371f82bf c3ac2e54981067ec1b83720252f202dc371f82bf
Total tests
1326
Failing since
#1 (Manual run by Martin Winter)

Tests

Responsible

This build has been failing since #1
No one has taken responsibility

Tests

Existing test failures 2
Status Test Failing since View job Duration
AssertionError: 2 tests failed
E   AssertionError: 2 tests failed
AssertionError: 2 tests failed
E   AssertionError: 2 tests failed

Shared artifacts

Artifact File size
VersionInfo 854 bytes
SourceCode 7 MB
Debian 10 (Buster) x86_64 Packages 27 MB