Topotest PR6212

Build: #8 failed Manual run by Martin Winter

Build result summary

Details

Completed
Duration
174 minutes
Labels
version=frr-7_4-dev-3396-g641148b1egit=https_//github_com/frrouting/frr_gitbuildurl=https_//ci1_netdef_org/browse/testing-ttpr6212-8branch=master
Revision
cdb8f3e4789d4e8ce15256547cbca57114095295 cdb8f3e4789d4e8ce15256547cbca57114095295
Total tests
6138
Failing since
#1 (Manual run by Martin Winter)
Fixed in
#9 (Manual run by Martin Winter)

Responsible

This build has been failing since #1
No one has taken responsibility

Tests

Existing test failures 2
Status Test Failing since View job Duration
AssertionError: Route scale test remove failed:   Generated JSON diff error report:         > $: d2 has key 'routes' which is not present in d1   > $: d2 has key 'routesTotalFib' which is not present in d1   > $: d2 has key 'routesTotal' which is not present in d1       assert False
E   AssertionError: Route scale test remove failed:
      Generated JSON diff error report:
      
      
      > $: d2 has key 'routes' which is not present in d1
      > $: d2 has key 'routesTotalFib' which is not present in d1
      > $: d2 has key 'routesTotal' which is not present in d1
(3 more lines...)
AssertionError: Route scale test install failed:   Generated JSON diff error report:         > $: d2 has key 'routes' which is not present in d1   > $: d2 has key 'routesTotalFib' which is not present in d1   > $: d2 has key 'routesTotal' which is not present in d1       assert False
E   AssertionError: Route scale test install failed:
      Generated JSON diff error report:
      
      
      > $: d2 has key 'routes' which is not present in d1
      > $: d2 has key 'routesTotalFib' which is not present in d1
      > $: d2 has key 'routesTotal' which is not present in d1
(3 more lines...)

Jira issues

IssueDescriptionStatus
Unknown Issue TypeFRR-7Could not obtain issue details from Jira