Topotest PR6212-Debug

Build: #2 failed Manual run by Martin Winter

Build result summary

Details

Completed
Duration
95 minutes
Labels
version=frr-7_4-dev-3396-g641148b1egit=https_//github_com/frrouting/frr_gitbuildurl=https_//ci1_netdef_org/browse/testing-ttpr6212debug-2branch=master
Revision
c14dba6241da01f29e1afc1f88b7c1571c18eb45 c14dba6241da01f29e1afc1f88b7c1571c18eb45
Total tests
5886
Failing since
#1 (Manual run by Martin Winter)

Responsible

This build has been failing since #1
No one has taken responsibility

Code commits

Author Commit Message Commit date
Quentin Young <qlyoung@nvidia.com> Quentin Young <qlyoung@nvidia.com> c14dba6241da01f29e1afc1f88b7c1571c18eb45 c14dba6241da01f29e1afc1f88b7c1571c18eb45 Revert "debian: Merge various debian changelogs in debian/changelog"
This reverts commit da3a39ff6a131039ef67e01637333353f3095adb.
Quentin Young <qlyoung@nvidia.com> Quentin Young <qlyoung@nvidia.com> 439be082d33dbabc4910d669ffb09384319716a4 439be082d33dbabc4910d669ffb09384319716a4 Revert "debian: Adjust tarsource.sh to use native debian/changelog"
This reverts commit 4ffb9a4c9ddd0ef3f770c0bc2674c4818331780d.
Quentin Young <qlyoung@nvidia.com> Quentin Young <qlyoung@nvidia.com> fb0b3592ca9b67124170d298ee55ab053ca0e2a8 fb0b3592ca9b67124170d298ee55ab053ca0e2a8 Revert "debian: Remove the changelog-auto automation in favor of dch"
This reverts commit cace1d9bf178d447599fe7caa5ccad9a89babe03.
Quentin Young <qlyoung@nvidia.com> Quentin Young <qlyoung@nvidia.com> 1b8a899da3514cdf6e0ec01069c419a578b22225 1b8a899da3514cdf6e0ec01069c419a578b22225 Revert "debian: Update tools/build-debian-package.sh to use git-buildpackage"
This reverts commit 63c0c8ed89e1564294ff174b819e520d5977f499.
Quentin Young <qlyoung@nvidia.com> Quentin Young <qlyoung@nvidia.com> 2013e82a89578f150b24b03e74cdff8d7675951f 2013e82a89578f150b24b03e74cdff8d7675951f Revert "debian: Remove now obsolete tarsource.sh script"
This reverts commit bc304e08ea48523b4c70d1d330eaefba3b6b7a6c.

Tests

Existing test failures 2
Status Test Failing since View job Duration
AssertionError: Route scale test install failed:   Generated JSON diff error report:         > $: d2 has key 'routes' which is not present in d1   > $: d2 has key 'routesTotalFib' which is not present in d1   > $: d2 has key 'routesTotal' which is not present in d1       assert False
E   AssertionError: Route scale test install failed:
      Generated JSON diff error report:
      
      
      > $: d2 has key 'routes' which is not present in d1
      > $: d2 has key 'routesTotalFib' which is not present in d1
      > $: d2 has key 'routesTotal' which is not present in d1
(3 more lines...)
AssertionError: Route scale test remove failed:   Generated JSON diff error report:         > $: d2 has key 'routes' which is not present in d1   > $: d2 has key 'routesTotalFib' which is not present in d1   > $: d2 has key 'routesTotal' which is not present in d1       assert False
E   AssertionError: Route scale test remove failed:
      Generated JSON diff error report:
      
      
      > $: d2 has key 'routes' which is not present in d1
      > $: d2 has key 'routesTotalFib' which is not present in d1
      > $: d2 has key 'routesTotal' which is not present in d1
(3 more lines...)

Jira issues

IssueDescriptionStatus
Unknown Issue TypeFRR-7Could not obtain issue details from Jira