Topotest PR7489

Build: #1 failed Manual run by Martin Winter

Stages & jobs

  1. Get Sourcecode

  2. Building Stage

  3. Basic Tests

  4. Final

    Final

Build result summary

Details

Completed
Duration
176 minutes
Labels
version=frr-7_4-dev-3871-g06aa91246git=https_//github_com/frrouting/frr_gitbuildurl=https_//ci1_netdef_org/browse/testing-ttpr7489-1branch=master
Revision
b2d8bcc52a7d31ad9aacdb578093dabf327fb563 b2d8bcc52a7d31ad9aacdb578093dabf327fb563
Total tests
6558

Tests

Responsible

No one has taken responsibility for this failure

Tests

New test failures 3
Status Test View job Duration
Collapse Failed test_bgp_gr_functionality_topo1 test_BGP_GR_TC_5_1_2_p1 History
Topo Tests Part 3 on Ubuntu 18.04 arm8 1 min
AssertionError: Testcase test_BGP_GR_TC_5_1_2_p1 : Failed     Error [DUT: r1]: remoteGrMode is not correct Expected: Restart, Found: NotApplicable assert '[DUT: r1]: remoteGrMode is not correct Expected: Restart, Found: NotApplicable' is True
E   AssertionError: Testcase test_BGP_GR_TC_5_1_2_p1 : Failed 
       Error [DUT: r1]: remoteGrMode is not correct Expected: Restart, Found: NotApplicable
    assert '[DUT: r1]: remoteGrMode is not correct Expected: Restart, Found: NotApplicable' is True
Collapse Failed test_bgp_gr_functionality_topo1 test_BGP_GR_TC_5_1_2_p1 History
Topo Tests Part 3 on Ubuntu 18.04 arm7 1 min
AssertionError: Testcase test_BGP_GR_TC_5_1_2_p1 : Failed     Error [DUT: r1]: remoteGrMode is not correct Expected: Restart, Found: NotApplicable assert '[DUT: r1]: remoteGrMode is not correct Expected: Restart, Found: NotApplicable' is True
E   AssertionError: Testcase test_BGP_GR_TC_5_1_2_p1 : Failed 
       Error [DUT: r1]: remoteGrMode is not correct Expected: Restart, Found: NotApplicable
    assert '[DUT: r1]: remoteGrMode is not correct Expected: Restart, Found: NotApplicable' is True
Collapse Failed test_bgp_multi_vrf_topo2 test_delete_and_re_add_vrf_p1 History
Topo Tests Part 2 on Ubuntu 16.04 arm8 VM 4 mins
AssertionError: Testcase test_delete_and_re_add_vrf_p1 :Failed     Error Missing route in RIB of router r2, routes: ['1.1.1.1/32', '1.1.1.2/32']    assert "Missing route in RIB of router r2, routes: ['1.1.1.1/32', '1.1.1.2/32']\n" is True
E   AssertionError: Testcase test_delete_and_re_add_vrf_p1 :Failed 
       Error Missing route in RIB of router r2, routes: ['1.1.1.1/32', '1.1.1.2/32']
      
    assert "Missing route in RIB of router r2, routes: ['1.1.1.1/32', '1.1.1.2/32']\n" is True