Topotest PR7489

Build: #2 failed Manual run by Martin Winter

Stages & jobs

  1. Get Sourcecode

  2. Building Stage

  3. Basic Tests

  4. Final

    Final

Build result summary

Details

Completed
Duration
185 minutes
Labels
version=frr-7_4-dev-3871-g06aa91246git=https_//github_com/frrouting/frr_gitbuildurl=https_//ci1_netdef_org/browse/testing-ttpr7489-2branch=master
Revision
b2d8bcc52a7d31ad9aacdb578093dabf327fb563 b2d8bcc52a7d31ad9aacdb578093dabf327fb563
Total tests
6558
Failing since
#1 (Manual run by Martin Winter)

Responsible

This build has been failing since #1
No one has taken responsibility

Tests

Existing test failures 2
Status Test Failing since View job Duration
AssertionError: Testcase test_BGP_GR_TC_5_1_2_p1 : Failed     Error [DUT: r1]: remoteGrMode is not correct Expected: Restart, Found: NotApplicable assert '[DUT: r1]: remoteGrMode is not correct Expected: Restart, Found: NotApplicable' is True
E   AssertionError: Testcase test_BGP_GR_TC_5_1_2_p1 : Failed 
       Error [DUT: r1]: remoteGrMode is not correct Expected: Restart, Found: NotApplicable
    assert '[DUT: r1]: remoteGrMode is not correct Expected: Restart, Found: NotApplicable' is True
AssertionError: Testcase test_BGP_GR_TC_5_1_2_p1 : Failed     Error [DUT: r1]: remoteGrMode is not correct Expected: Restart, Found: NotApplicable assert '[DUT: r1]: remoteGrMode is not correct Expected: Restart, Found: NotApplicable' is True
E   AssertionError: Testcase test_BGP_GR_TC_5_1_2_p1 : Failed 
       Error [DUT: r1]: remoteGrMode is not correct Expected: Restart, Found: NotApplicable
    assert '[DUT: r1]: remoteGrMode is not correct Expected: Restart, Found: NotApplicable' is True
Fixed tests 1
Status Test Failing since View job Duration
Successful test_bgp_multi_vrf_topo2 test_delete_and_re_add_vrf_p1 History
Failing since build #1 (Manual run by Martin Winter) Topo Tests Part 2 on Ubuntu 16.04 arm8 VM 1 min