Topotest PR7489

Build: #5 failed Manual run by Martin Winter

Stages & jobs

  1. Get Sourcecode

  2. Building Stage

  3. Basic Tests

  4. Final

    Final

Test results

  • 6,558 tests in total
  • 2 tests failed
  • 406 tests were quarantined / skipped
  • 1117 minutes taken in total.
Existing test failures 2
Status Test Failing since View job Duration
AssertionError: Testcase test_BGP_GR_TC_5_1_2_p1 : Failed     Error [DUT: r1]: remoteGrMode is not correct Expected: Restart, Found: NotApplicable assert '[DUT: r1]: remoteGrMode is not correct Expected: Restart, Found: NotApplicable' is True
E   AssertionError: Testcase test_BGP_GR_TC_5_1_2_p1 : Failed 
       Error [DUT: r1]: remoteGrMode is not correct Expected: Restart, Found: NotApplicable
    assert '[DUT: r1]: remoteGrMode is not correct Expected: Restart, Found: NotApplicable' is True
AssertionError: Testcase test_BGP_GR_TC_5_1_2_p1 : Failed     Error [DUT: r1]: remoteGrMode is not correct Expected: Restart, Found: NotApplicable assert '[DUT: r1]: remoteGrMode is not correct Expected: Restart, Found: NotApplicable' is True
E   AssertionError: Testcase test_BGP_GR_TC_5_1_2_p1 : Failed 
       Error [DUT: r1]: remoteGrMode is not correct Expected: Restart, Found: NotApplicable
    assert '[DUT: r1]: remoteGrMode is not correct Expected: Restart, Found: NotApplicable' is True
Skipped tests 100
Status Test Failing since View job
Skipped test_evpn_mh test_evpn_ead_update History
Topo Tests Part 1 on Ubuntu 16.04 amd64
Skipped test_evpn_mh test_evpn_mac History
Topo Tests Part 1 on Ubuntu 16.04 amd64
Skipped test_evpn_mh test_evpn_df History
Topo Tests Part 1 on Ubuntu 18.04 amd64
Skipped test_evpn_mh test_evpn_uplink_tracking History
Topo Tests Part 1 on Ubuntu 16.04 amd64
Skipped test_evpn_mh test_evpn_ead_update History
Topo Tests Part 1 on Ubuntu 18.04 amd64
Skipped test_evpn_mh test_evpn_mac History
Topo Tests Part 1 on Ubuntu 16.04 i386
Skipped test_evpn_mh test_evpn_ead_update History
Topo Tests Part 1 on Ubuntu 16.04 arm8 VM
Skipped test_evpn_mh test_evpn_uplink_tracking History
Topo Tests Part 1 on Ubuntu 16.04 i386
Skipped test_evpn_mh test_evpn_mac History
Topo Tests Part 1 on Ubuntu 18.04 amd64
Skipped test_evpn_mh test_evpn_es History
Topo Tests Part 1 on Ubuntu 16.04 amd64
Skipped test_evpn_mh test_evpn_es History
Topo Tests Part 1 on Ubuntu 16.04 i386
Skipped test_evpn_mh test_evpn_mac History
Topo Tests Part 1 on Ubuntu 16.04 arm8 VM
Skipped test_evpn_mh test_evpn_es History
Topo Tests Part 1 on Ubuntu 18.04 amd64
Skipped test_evpn_mh test_evpn_df History
Topo Tests Part 1 on Ubuntu 16.04 amd64
Skipped test_evpn_mh test_evpn_df History
Topo Tests Part 1 on Ubuntu 16.04 arm8 VM
Skipped test_evpn_mh test_evpn_df History
Topo Tests Part 1 on Ubuntu 16.04 i386
Skipped test_evpn_mh test_evpn_uplink_tracking History
Topo Tests Part 1 on Ubuntu 16.04 arm8 VM
Skipped test_evpn_mh test_evpn_es History
Topo Tests Part 1 on Ubuntu 16.04 arm8 VM
Skipped test_evpn_mh test_evpn_ead_update History
Topo Tests Part 1 on Ubuntu 16.04 i386
Skipped test_evpn_mh test_evpn_uplink_tracking History
Topo Tests Part 1 on Ubuntu 18.04 amd64
Skipped test_bgp_evpn test_memory_leak History
Topo Tests Part 1 on Ubuntu 16.04 arm8 VM
Skipped test_bgp_evpn test_protocols_convergence History
Topo Tests Part 1 on Ubuntu 16.04 arm8 VM
Skipped test_bgp_evpn test_protocols_convergence History
Topo Tests Part 1 on Ubuntu 16.04 i386
Skipped test_bgp_evpn test_memory_leak History
Topo Tests Part 1 on Ubuntu 16.04 i386
Skipped test_bgp_evpn test_memory_leak History
Topo Tests Part 1 on Ubuntu 18.04 amd64
Skipped test_bgp_evpn test_protocols_convergence History
Topo Tests Part 1 on Ubuntu 18.04 amd64
Skipped test_bgp_evpn test_memory_leak History
Topo Tests Part 1 on Ubuntu 16.04 amd64
Skipped test_bgp_evpn test_protocols_convergence History
Topo Tests Part 1 on Ubuntu 16.04 amd64
Skipped test_bgp_gr_functionality_topo1 test_BGP_GR_TC_8_p1 History
Topo Tests Part 3 on Ubuntu 18.04 arm8
Skipped test_bgp_gr_functionality_topo1 test_BGP_GR_TC_52_p1 History
Topo Tests Part 3 on Ubuntu 18.04 arm8
Skipped test_bgp_gr_functionality_topo1 test_BGP_GR_TC_31_2_p1 History
Topo Tests Part 3 on Ubuntu 18.04 arm8
Skipped test_bgp_gr_functionality_topo1 test_BGP_GR_TC_20_p1 History
Topo Tests Part 3 on Ubuntu 18.04 arm8
Skipped test_bgp_gr_functionality_topo1 test_BGP_GR_TC_50_p1 History
Topo Tests Part 3 on Ubuntu 16.04 i386
Skipped test_bgp_gr_functionality_topo1 test_BGP_GR_TC_44_p1 History
Topo Tests Part 3 on Ubuntu 18.04 arm8
Skipped test_bgp_gr_functionality_topo1 test_BGP_GR_TC_9_p1 History
Topo Tests Part 3 on Ubuntu 18.04 arm8
Skipped test_bgp_gr_functionality_topo1 test_BGP_GR_TC_47_p1 History
Topo Tests Part 3 on Ubuntu 18.04 arm8
Skipped test_bgp_gr_functionality_topo1 test_BGP_GR_TC_6_1_2_p1 History
Topo Tests Part 3 on Ubuntu 18.04 arm8
Skipped test_bgp_gr_functionality_topo1 test_BGP_GR_TC_19_p1 History
Topo Tests Part 3 on Ubuntu 18.04 arm8
Skipped test_bgp_gr_functionality_topo1 test_BGP_GR_TC_17_p1 History
Topo Tests Part 3 on Ubuntu 18.04 amd64
Skipped test_bgp_gr_functionality_topo1 test_BGP_GR_TC_48_p1 History
Topo Tests Part 3 on Ubuntu 16.04 i386
Skipped test_bgp_gr_functionality_topo1 test_BGP_GR_TC_45_p1 History
Topo Tests Part 3 on Ubuntu 18.04 arm8
Skipped test_bgp_gr_functionality_topo1 test_BGP_GR_TC_31_1_p1 History
Topo Tests Part 3 on Ubuntu 18.04 arm8
Skipped test_bgp_gr_functionality_topo1 test_BGP_GR_TC_43_p1 History
Topo Tests Part 3 on Ubuntu 18.04 arm8
Skipped test_bgp_gr_functionality_topo1 test_BGP_GR_TC_4_p0 History
Topo Tests Part 3 on Ubuntu 16.04 amd64
Skipped test_bgp_gr_functionality_topo1 test_BGP_GR_TC_48_p1 History
Topo Tests Part 3 on Ubuntu 16.04 amd64
Skipped test_bgp_gr_functionality_topo1 test_BGP_GR_TC_17_p1 History
Topo Tests Part 3 on Ubuntu 16.04 i386
Skipped test_bgp_gr_functionality_topo1 test_BGP_GR_TC_31_1_p1 History
Topo Tests Part 3 on Ubuntu 16.04 amd64
Skipped test_bgp_gr_functionality_topo1 test_BGP_GR_TC_47_p1 History
Topo Tests Part 3 on Ubuntu 16.04 i386
Skipped test_bgp_gr_functionality_topo1 test_BGP_GR_TC_31_2_p1 History
Topo Tests Part 3 on Ubuntu 16.04 i386
Skipped test_bgp_gr_functionality_topo1 test_BGP_GR_TC_46_p1 History
Topo Tests Part 3 on Ubuntu 18.04 amd64
Skipped test_bgp_gr_functionality_topo1 test_BGP_GR_TC_31_1_p1 History
Topo Tests Part 3 on Ubuntu 16.04 i386
Skipped test_bgp_gr_functionality_topo1 test_BGP_GR_TC_19_p1 History
Topo Tests Part 3 on Ubuntu 16.04 i386
Skipped test_bgp_gr_functionality_topo1 test_BGP_GR_TC_46_p1 History
Topo Tests Part 3 on Ubuntu 16.04 i386
Skipped test_bgp_gr_functionality_topo1 test_BGP_GR_TC_48_p1 History
Topo Tests Part 3 on Ubuntu 18.04 arm8
Skipped test_bgp_gr_functionality_topo1 test_BGP_GR_TC_52_p1 History
Topo Tests Part 3 on Ubuntu 16.04 amd64
Skipped test_bgp_gr_functionality_topo1 test_BGP_GR_TC_53_p1 History
Topo Tests Part 3 on Ubuntu 16.04 i386
Skipped test_bgp_gr_functionality_topo1 test_BGP_GR_TC_31_2_p1 History
Topo Tests Part 3 on Ubuntu 16.04 amd64
Skipped test_bgp_gr_functionality_topo1 test_BGP_GR_TC_17_p1 History
Topo Tests Part 3 on Ubuntu 18.04 arm8
Skipped test_bgp_gr_functionality_topo1 test_BGP_GR_TC_44_p1 History
Topo Tests Part 3 on Ubuntu 16.04 amd64
Skipped test_bgp_gr_functionality_topo1 test_BGP_GR_TC_51_p1 History
Topo Tests Part 3 on Ubuntu 16.04 i386
Skipped test_bgp_gr_functionality_topo1 test_BGP_GR_TC_6_1_2_p1 History
Topo Tests Part 3 on Ubuntu 16.04 amd64
Skipped test_bgp_gr_functionality_topo1 test_BGP_GR_TC_46_p1 History
Topo Tests Part 3 on Ubuntu 18.04 arm8
Skipped test_bgp_gr_functionality_topo1 test_BGP_GR_TC_45_p1 History
Topo Tests Part 3 on Ubuntu 16.04 amd64
Skipped test_bgp_gr_functionality_topo1 test_BGP_GR_TC_20_p1 History
Topo Tests Part 3 on Ubuntu 16.04 i386
Skipped test_bgp_gr_functionality_topo1 test_BGP_GR_TC_45_p1 History
Topo Tests Part 3 on Ubuntu 16.04 i386
Skipped test_bgp_gr_functionality_topo1 test_BGP_GR_TC_46_p1 History
Topo Tests Part 3 on Ubuntu 16.04 arm8 VM
Skipped test_bgp_gr_functionality_topo1 test_BGP_GR_TC_19_p1 History
Topo Tests Part 3 on Ubuntu 16.04 arm8 VM
Skipped test_bgp_gr_functionality_topo1 test_BGP_GR_TC_51_p1 History
Topo Tests Part 3 on Ubuntu 16.04 arm8 VM
Skipped test_bgp_gr_functionality_topo1 test_BGP_GR_TC_8_p1 History
Topo Tests Part 3 on Ubuntu 16.04 arm8 VM
Skipped test_bgp_gr_functionality_topo1 test_BGP_GR_TC_5_1_2_p1 History
Topo Tests Part 3 on Ubuntu 16.04 arm8 VM
Skipped test_bgp_gr_functionality_topo1 test_BGP_GR_TC_5_1_2_p1 History
Topo Tests Part 3 on Ubuntu 16.04 i386
Skipped test_bgp_gr_functionality_topo1 test_BGP_GR_TC_31_1_p1 History
Topo Tests Part 3 on Ubuntu 16.04 arm8 VM
Skipped test_bgp_gr_functionality_topo1 test_BGP_GR_TC_4_p0 History
Topo Tests Part 3 on Ubuntu 16.04 arm8 VM
Skipped test_bgp_gr_functionality_topo1 test_BGP_GR_TC_45_p1 History
Topo Tests Part 3 on Ubuntu 16.04 arm8 VM
Skipped test_bgp_gr_functionality_topo1 test_BGP_GR_TC_50_p1 History
Topo Tests Part 3 on Ubuntu 16.04 arm8 VM
Skipped test_bgp_gr_functionality_topo1 test_BGP_GR_TC_5_1_2_p1 History
Topo Tests Part 3 on Ubuntu 16.04 amd64
Skipped test_bgp_gr_functionality_topo1 test_BGP_GR_TC_49_p1 History
Topo Tests Part 3 on Ubuntu 16.04 arm8 VM
Skipped test_bgp_gr_functionality_topo1 test_BGP_GR_TC_9_p1 History
Topo Tests Part 3 on Ubuntu 16.04 i386
Skipped test_bgp_gr_functionality_topo1 test_BGP_GR_TC_51_p1 History
Topo Tests Part 3 on Ubuntu 16.04 amd64
Skipped test_bgp_gr_functionality_topo1 test_BGP_GR_TC_44_p1 History
Topo Tests Part 3 on Ubuntu 16.04 i386
Skipped test_bgp_gr_functionality_topo1 test_BGP_GR_TC_53_p1 History
Topo Tests Part 3 on Ubuntu 16.04 amd64
Skipped test_bgp_gr_functionality_topo1 test_BGP_GR_TC_8_p1 History
Topo Tests Part 3 on Ubuntu 18.04 amd64
Skipped test_bgp_gr_functionality_topo1 test_BGP_GR_TC_46_p1 History
Topo Tests Part 3 on Ubuntu 16.04 amd64
Skipped test_bgp_gr_functionality_topo1 test_BGP_GR_TC_8_p1 History
Topo Tests Part 3 on Ubuntu 16.04 i386
Skipped test_bgp_gr_functionality_topo1 test_BGP_GR_TC_19_p1 History
Topo Tests Part 3 on Ubuntu 16.04 amd64
Skipped test_bgp_gr_functionality_topo1 test_BGP_GR_TC_53_p1 History
Topo Tests Part 3 on Ubuntu 16.04 arm8 VM
Skipped test_bgp_gr_functionality_topo1 test_BGP_GR_TC_50_p1 History
Topo Tests Part 3 on Ubuntu 16.04 amd64
Skipped test_bgp_gr_functionality_topo1 test_BGP_GR_TC_50_p1 History
Topo Tests Part 3 on Ubuntu 18.04 amd64
Skipped test_bgp_gr_functionality_topo1 test_BGP_GR_TC_48_p1 History
Topo Tests Part 3 on Ubuntu 18.04 amd64
Skipped test_bgp_gr_functionality_topo1 test_BGP_GR_TC_4_p0 History
Topo Tests Part 3 on Ubuntu 18.04 amd64
Skipped test_bgp_gr_functionality_topo1 test_BGP_GR_TC_45_p1 History
Topo Tests Part 3 on Ubuntu 18.04 amd64
Skipped test_bgp_gr_functionality_topo1 test_BGP_GR_TC_19_p1 History
Topo Tests Part 3 on Ubuntu 18.04 amd64
Skipped test_bgp_gr_functionality_topo1 test_BGP_GR_TC_53_p1 History
Topo Tests Part 3 on Ubuntu 18.04 amd64
Skipped test_bgp_gr_functionality_topo1 test_BGP_GR_TC_51_p1 History
Topo Tests Part 3 on Ubuntu 18.04 amd64
Skipped test_bgp_gr_functionality_topo1 test_BGP_GR_TC_6_1_2_p1 History
Topo Tests Part 3 on Ubuntu 18.04 amd64
Skipped test_bgp_gr_functionality_topo1 test_BGP_GR_TC_9_p1 History
Topo Tests Part 3 on Ubuntu 18.04 amd64
Skipped test_bgp_gr_functionality_topo1 test_BGP_GR_TC_52_p1 History
Topo Tests Part 3 on Ubuntu 18.04 amd64
Skipped test_bgp_gr_functionality_topo1 test_BGP_GR_TC_43_p1 History
Topo Tests Part 3 on Ubuntu 18.04 amd64
Skipped test_bgp_gr_functionality_topo1 test_BGP_GR_TC_49_p1 History
Topo Tests Part 3 on Ubuntu 18.04 amd64
Skipped test_bgp_gr_functionality_topo1 test_BGP_GR_TC_9_p1 History
Topo Tests Part 3 on Ubuntu 16.04 amd64