Topotest PR7489

Build: #1 failed

Job: Topo Tests Part 1 on Ubuntu 18.04 amd64 was successful

Stages & jobs

  1. Get Sourcecode

  2. Building Stage

  3. Basic Tests

  4. Final

    Final

Job result summary

Completed
Duration
51 minutes
Total tests
186

Tests

  • 186 tests in total
  • 7 tests were quarantined / skipped
  • 51 minutes taken in total.

Error summary

The build generated some errors. See the full build log for more details.


Usage:
kill [options] <pid> [...]

Options:
<pid> [...]            send signal to every <pid> listed
-<signal>, -s, --signal <signal>
                        specify the <signal> to be sent
-l, --list=[<signal>]  list all signal names, or convert one to a name
-L, --table            list all signal names in a nice table

-h, --help     display this help and exit
-V, --version  output version information and exit

For more details see kill(1).
+ vm=
+ host=
+ sshport=
+ [[ -z frr ]]
+ PROJECT=frr
+ DIRECTORY=frr-source
+ buildnum=1
+ echo 'removing basic FRR/Quagga packages'
+ DEBIAN_FRONTEND=noninteractive
+ apt-get -y purge quagga-test
+ true
+ DEBIAN_FRONTEND=noninteractive
+ apt-get -y purge quagga
+ true
+ true
+ DEBIAN_FRONTEND=noninteractive
+ apt-get -y purge quagga-test-doc
+ DEBIAN_FRONTEND=noninteractive
+ apt-get -y purge quagga-doc
+ true
+ true
+ DEBIAN_FRONTEND=noninteractive
+ apt-get -y purge frr-test
+ DEBIAN_FRONTEND=noninteractive
+ apt-get -y purge frr
+ true
+ true
+ DEBIAN_FRONTEND=noninteractive
+ apt-get -y purge frr-test-doc
+ true
+ DEBIAN_FRONTEND=noninteractive
+ apt-get -y purge frr-doc
+ echo 'removing extra packages DEBs'
+ DEBIAN_FRONTEND=noninteractive
+ apt-get -y purge librtr0 librtr libyang
+ exit 0
+ vm=
+ host=
+ sshport=
+ [[ -z frr ]]
+ PROJECT=frr
+ DIRECTORY=frr-source
+ buildnum=1
+ build=cipkg.1
+ echo 'Step 1) Install libyang DEBs'
+ rm -f 'extrapkg/*'
+ install -d extrapkg
+ mv libyang1_1.0.184-5-g6defee4c-1~1.gbpc40dbd_amd64.deb libyang-cpp1_1.0.184-5-g6defee4c-1~1.gbpc40dbd_amd64.deb libyang-cpp-dev_1.0.184-5-g6defee4c-1~1.gbpc40dbd_amd64.deb libyang-dev_1.0.184-5-g6defee4c-1~1.gbpc40dbd_amd64.deb libyang-tools_1.0.184-5-g6defee4c-1~1.gbpc40dbd_amd64.deb extrapkg/
+ DEBIAN_FRONTEND=noninteractive
+ apt-get purge -y libyang
+ true
+ true
+ DEBIAN_FRONTEND=noninteractive
+ apt-get purge -y libyang0.16
+ DEBIAN_FRONTEND=noninteractive
+ dpkg -i extrapkg/libyang1_1.0.184-5-g6defee4c-1~1.gbpc40dbd_amd64.deb extrapkg/libyang-cpp1_1.0.184-5-g6defee4c-1~1.gbpc40dbd_amd64.deb extrapkg/libyang-cpp-dev_1.0.184-5-g6defee4c-1~1.gbpc40dbd_amd64.deb extrapkg/libyang-dev_1.0.184-5-g6defee4c-1~1.gbpc40dbd_amd64.deb extrapkg/libyang-tools_1.0.184-5-g6defee4c-1~1.gbpc40dbd_amd64.deb
+ '[' 0 -ne 0 ']'
+ rm -f libyang_1.0.184-5-g6defee4c-1~1.gbpc40dbd_amd64.buildinfo libyang_1.0.184-5-g6defee4c-1~1.gbpc40dbd_amd64.changes
+ rm -rf extrapkg
+ true
+ DEBIAN_FRONTEND=noninteractive
+ apt-get purge -y librtr0
+ ls librtr0_0.7.0.0_amd64.deb
+ echo 'Step 2) Install rtrlib DEBs'
+ rm -f 'extrapkg/*'
+ install -d extrapkg
+ mv librtr0_0.7.0.0_amd64.deb librtr-dbg_0.7.0.0_amd64.deb librtr-dev_0.7.0.0_amd64.deb librtr-doc_0.7.0.0_all.deb extrapkg/
+ rm -f extrapkg/librtr-dbg_0.7.0.0_amd64.deb
+ rm -f extrapkg/librtr-doc_0.7.0.0_all.deb
+ DEBIAN_FRONTEND=noninteractive
+ dpkg -i extrapkg/librtr0_0.7.0.0_amd64.deb extrapkg/librtr-dev_0.7.0.0_amd64.deb
+ '[' 0 -ne 0 ']'
+ rm -f librtr0_0.7.0.0_amd64.build librtr0_0.7.0.0_amd64.changes
+ rm -f rtr-tools_0.7.0.0_amd64.deb rtr-tools-dbg_0.7.0.0_amd64.deb
+ rm -rf extrapkg
+ exit 0
+ [[ -z frr ]]
+ PROJECT=frr
+ DEBIAN_FRONTEND=noninteractive
+ apt-get -y purge quagga-test
+ true
+ true
+ DEBIAN_FRONTEND=noninteractive
+ apt-get -y purge quagga
+ DEBIAN_FRONTEND=noninteractive
+ apt-get -y purge quagga-test-doc
+ true
+ true
+ DEBIAN_FRONTEND=noninteractive
+ apt-get -y purge quagga-doc
+ DEBIAN_FRONTEND=noninteractive
+ apt-get -y purge frr-test
+ true
+ true
+ DEBIAN_FRONTEND=noninteractive
+ apt-get -y purge frr
+ DEBIAN_FRONTEND=noninteractive
+ apt-get -y purge frr-test-doc
+ true
+ true
+ DEBIAN_FRONTEND=noninteractive
+ apt-get -y purge frr-doc
+ rm -rf /etc/quagga
+ rm -rf /usr/lib/quagga
+ rm -rf /etc/frr
+ rm -rf /usr/lib/frr
+ rm -f /usr/bin/vtysh
+ rm -rf /var/log/frr
+ rm -rf /var/log/quagga
+ rm -rf /var/run/frr
+ rm -rf /var/run/quagga
+ true
+ sudo userdel frr
+ sudo groupdel frr
+ true
+ sudo groupdel frrvty
+ true
+ true
+ sudo userdel quagga
+ true
+ sudo groupdel quagga
+ sudo groupdel quaggavty
+ true
+ true
+ DEBIAN_FRONTEND=noninteractive
+ snap remove quagga
+ true
+ DEBIAN_FRONTEND=noninteractive
+ snap remove frr
+ rm -f 'debpkg/*'
+ install -d debpkg
+ mv frr_7.6-dev-20201208-02-g06aa91246-0~ubuntu18.04.1_amd64.deb frr-dbgsym_7.6-dev-20201208-02-g06aa91246-0~ubuntu18.04.1_amd64.ddeb frr-doc_7.6-dev-20201208-02-g06aa91246-0~ubuntu18.04.1_all.deb frr-pythontools_7.6-dev-20201208-02-g06aa91246-0~ubuntu18.04.1_all.deb frr-rpki-rtrlib_7.6-dev-20201208-02-g06aa91246-0~ubuntu18.04.1_amd64.deb frr-rpki-rtrlib-dbgsym_7.6-dev-20201208-02-g06aa91246-0~ubuntu18.04.1_amd64.ddeb frr-snmp_7.6-dev-20201208-02-g06aa91246-0~ubuntu18.04.1_amd64.deb frr-snmp-dbgsym_7.6-dev-20201208-02-g06aa91246-0~ubuntu18.04.1_amd64.ddeb yang-tools_1.0.184-5-g6defee4c-1~1.gbpc40dbd_all.deb debpkg/
+ rm -f 'quagga*'
+ rm -f frr_7.6-dev-20201208-02-g06aa91246-0.debian.tar.xz frr_7.6-dev-20201208-02-g06aa91246-0.dsc frr_7.6-dev-20201208-02-g06aa91246-0_source.changes frr_7.6-dev-20201208-02-g06aa91246-0~ubuntu18.04.1_amd64.buildinfo frr_7.6-dev-20201208-02-g06aa91246-0~ubuntu18.04.1_amd64.changes frr_7.6-dev-20201208-02-g06aa91246-0~ubuntu18.04.1.debian.tar.xz frr_7.6-dev-20201208-02-g06aa91246-0~ubuntu18.04.1.dsc frr_7.6-dev-20201208-02-g06aa91246.orig.tar.xz frr-source.tar.gz
+ rm -f 'debpkg/quagga*-doc*.deb'
+ rm -f debpkg/frr-doc_7.6-dev-20201208-02-g06aa91246-0~ubuntu18.04.1_all.deb
+ DEBIAN_FRONTEND=noninteractive
+ dpkg -i debpkg/frr_7.6-dev-20201208-02-g06aa91246-0~ubuntu18.04.1_amd64.deb debpkg/frr-dbgsym_7.6-dev-20201208-02-g06aa91246-0~ubuntu18.04.1_amd64.ddeb debpkg/frr-pythontools_7.6-dev-20201208-02-g06aa91246-0~ubuntu18.04.1_all.deb debpkg/frr-rpki-rtrlib_7.6-dev-20201208-02-g06aa91246-0~ubuntu18.04.1_amd64.deb debpkg/frr-rpki-rtrlib-dbgsym_7.6-dev-20201208-02-g06aa91246-0~ubuntu18.04.1_amd64.ddeb debpkg/frr-snmp_7.6-dev-20201208-02-g06aa91246-0~ubuntu18.04.1_amd64.deb debpkg/frr-snmp-dbgsym_7.6-dev-20201208-02-g06aa91246-0~ubuntu18.04.1_amd64.ddeb debpkg/yang-tools_1.0.184-5-g6defee4c-1~1.gbpc40dbd_all.deb
Created symlink /etc/systemd/system/multi-user.target.wants/frr.service → /lib/systemd/system/frr.service.
+ DEBIAN_FRONTEND=noninteractive
+ apt-get install -f -y
+ systemctld stop frr
+ true
+ killall -q watchquagga
+ killall -q bgpd
+ killall -q ospfd
+ killall -q ripd
+ killall -q ripngd
+ killall -q ospf6d
+ killall -q pimd
+ killall -q isisd
+ killall -q ldpd
+ killall -q nhrpd
+ killall -q eigrpd
+ killall -q babeld
+ killall -q vrrpd
+ killall -q staticd
+ killall -q zebra
+ killall -q exabgp
+ mn -c
+ rm -rf '/tmp/*.log'
+ rm -rf /tmp/topotests
+ rm -f '/tmp/*.err'
+ rm -f /tmp/AddressSanitzer.txt
+ rm -rf /var/tmp/frr/bgpd.32457 /var/tmp/frr/bgpd.32551 /var/tmp/frr/bgpd.32648 /var/tmp/frr/bgpd.32733 /var/tmp/frr/bgpd.4027 /var/tmp/frr/bgpd.4103 /var/tmp/frr/bgpd.4182 /var/tmp/frr/bgpd.4264 /var/tmp/frr/bgpd.4382 /var/tmp/frr/bgpd.4497 /var/tmp/frr/bgpd.4609 /var/tmp/frr/bgpd.5178 /var/tmp/frr/bgpd.5254 /var/tmp/frr/bgpd.5336 /var/tmp/frr/bgpd.5422 /var/tmp/frr/bgpd.552 /var/tmp/frr/bgpd.5540 /var/tmp/frr/bgpd.5665 /var/tmp/frr/bgpd.5777 /var/tmp/frr/bgpd.665 /var/tmp/frr/bgpd.766 /var/tmp/frr/bgpd.859 /var/tmp/frr/eigrpd.1901 /var/tmp/frr/eigrpd.1959 /var/tmp/frr/eigrpd.2025 /var/tmp/frr/ospfd.17834 /var/tmp/frr/ospfd.17902 /var/tmp/frr/ospfd.17978 /var/tmp/frr/ospfd.18054 /var/tmp/frr/ospfd.19059 /var/tmp/frr/ospfd.19127 /var/tmp/frr/ospfd.19203 /var/tmp/frr/ospfd.19277 /var/tmp/frr/ospfd.21351 /var/tmp/frr/ospfd.21420 /var/tmp/frr/ospfd.22474 /var/tmp/frr/ospfd.22552 /var/tmp/frr/ospfd.22630 /var/tmp/frr/ospfd.24508 /var/tmp/frr/ospfd.24556 /var/tmp/frr/ospfd.24600 /var/tmp/frr/ospfd.24640 /var/tmp/frr/ospfd.25661 /var/tmp/frr/ospfd.25747 /var/tmp/frr/ospfd.25825 /var/tmp/frr/staticd.21684 /var/tmp/frr/staticd.32432 /var/tmp/frr/staticd.32517 /var/tmp/frr/staticd.32614 /var/tmp/frr/staticd.32708 /var/tmp/frr/staticd.3984 /var/tmp/frr/staticd.4087 /var/tmp/frr/staticd.4157 /var/tmp/frr/staticd.4239 /var/tmp/frr/staticd.4330 /var/tmp/frr/staticd.4454 /var/tmp/frr/staticd.4566 /var/tmp/frr/staticd.5135 /var/tmp/frr/staticd.5238 /var/tmp/frr/staticd.525 /var/tmp/frr/staticd.5311 /var/tmp/frr/staticd.5397 /var/tmp/frr/staticd.5488 /var/tmp/frr/staticd.5622 /var/tmp/frr/staticd.5734 /var/tmp/frr/staticd.626 /var/tmp/frr/staticd.731 /var/tmp/frr/staticd.830 /var/tmp/frr/watchfrr.19594 /var/tmp/frr/zebra.21677 /var/tmp/frr/zebra.32427 /var/tmp/frr/zebra.32512 /var/tmp/frr/zebra.32609 /var/tmp/frr/zebra.32703 /var/tmp/frr/zebra.3979 /var/tmp/frr/zebra.4082 /var/tmp/frr/zebra.4152 /var/tmp/frr/zebra.4234 /var/tmp/frr/zebra.4325 /var/tmp/frr/zebra.4449 /var/tmp/frr/zebra.4561 /var/tmp/frr/zebra.5130 /var/tmp/frr/zebra.520 /var/tmp/frr/zebra.5233 /var/tmp/frr/zebra.5306 /var/tmp/frr/zebra.5392 /var/tmp/frr/zebra.5483 /var/tmp/frr/zebra.5617 /var/tmp/frr/zebra.5729 /var/tmp/frr/zebra.621 /var/tmp/frr/zebra.725 /var/tmp/frr/zebra.824
+ rm -rf
+ git clone --quiet https://git.netdef.org/scm/osr/topotest-split.git toposplit
+ '[' '' '!=' '' ']'
+ cd topotests
+ ../toposplit/topotest_job.py -c ../toposplit/topo_jobs.ini 1
+ cp pytest_job.ini pytest.ini
+ host=mininet414.lab.netdef.org
+ echo 'Running Topology Tests on mininet414.lab.netdef.org'
+ cd topotests
+ export VTYSH_PAGER=/bin/cat
+ VTYSH_PAGER=/bin/cat
+ export TOPOTESTS_CHECK_MEMLEAK=memleak_
+ TOPOTESTS_CHECK_MEMLEAK=memleak_
+ /usr/local/bin/py.test --junitxml ../topotests.xml -vv -s --tb=no
++ /usr/bin/tee log_topotests.txt
2020-12-18 12:42:09,582 ERROR: Traceback (most recent call last):
  File "/root/bamboo-agent-home/xml-data/build-dir/TESTING-TTPR7489-TP1U1804AMD64/topotests/lib/bgp.py", line 201, in create_router_bgp
    tgen, router, data_all_bgp, "bgp", build, load_config
  File "/root/bamboo-agent-home/xml-data/build-dir/TESTING-TTPR7489-TP1U1804AMD64/topotests/lib/common_config.py", line 289, in create_common_configuration
    load_config_to_router(tgen, router)
  File "/root/bamboo-agent-home/xml-data/build-dir/TESTING-TTPR7489-TP1U1804AMD64/topotests/lib/common_config.py", line 575, in load_config_to_router
    raise InvalidCLIError("%s" % output)
InvalidCLIError: line 6: % Unknown command[27]: neighbor 10.0.0.13 remote-as 0
line 8: % Unknown command[30]: neighbor fd00:0:0:3::1 remote-as 0
% Specify remote-as or peer-group commands first
line 10: Failure to communicate[13] to bgpd, line: neighbor fd00:0:0:3::1 activate

% Specify remote-as or peer-group commands first
line 12: Failure to communicate[13] to bgpd, line: no neighbor fd00:0:0:3::1 activate



2020-12-18 12:42:09,887 ERROR: Traceback (most recent call last):
  File "/root/bamboo-agent-home/xml-data/build-dir/TESTING-TTPR7489-TP1U1804AMD64/topotests/lib/bgp.py", line 201, in create_router_bgp
    tgen, router, data_all_bgp, "bgp", build, load_config
  File "/root/bamboo-agent-home/xml-data/build-dir/TESTING-TTPR7489-TP1U1804AMD64/topotests/lib/common_config.py", line 289, in create_common_configuration
    load_config_to_router(tgen, router)
  File "/root/bamboo-agent-home/xml-data/build-dir/TESTING-TTPR7489-TP1U1804AMD64/topotests/lib/common_config.py", line 575, in load_config_to_router
    raise InvalidCLIError("%s" % output)
InvalidCLIError: % No BGP process is configured
line 2: Failure to communicate[13] to bgpd, line: no router bgp 



2020-12-18 13:10:31,606 ERROR: r6: bgpd left a dead pidfile (pid=17755)
2020-12-18 13:24:04,878 ERROR: Traceback (most recent call last):
  File "/root/bamboo-agent-home/xml-data/build-dir/TESTING-TTPR7489-TP1U1804AMD64/topotests/lib/common_config.py", line 1513, in create_interfaces_cfg
    tgen, c_router, interface_data, "interface_config", build=build
  File "/root/bamboo-agent-home/xml-data/build-dir/TESTING-TTPR7489-TP1U1804AMD64/topotests/lib/common_config.py", line 289, in create_common_configuration
    load_config_to_router(tgen, router)
  File "/root/bamboo-agent-home/xml-data/build-dir/TESTING-TTPR7489-TP1U1804AMD64/topotests/lib/common_config.py", line 575, in load_config_to_router
    raise InvalidCLIError("%s" % output)
InvalidCLIError: line 3: % Unknown command[16]: ip ospf  hello-interval 65536


2020-12-18 13:24:32,067 ERROR: Traceback (most recent call last):
  File "/root/bamboo-agent-home/xml-data/build-dir/TESTING-TTPR7489-TP1U1804AMD64/topotests/lib/common_config.py", line 1513, in create_interfaces_cfg
    tgen, c_router, interface_data, "interface_config", build=build
  File "/root/bamboo-agent-home/xml-data/build-dir/TESTING-TTPR7489-TP1U1804AMD64/topotests/lib/common_config.py", line 289, in create_common_configuration
    load_config_to_router(tgen, router)
  File "/root/bamboo-agent-home/xml-data/build-dir/TESTING-TTPR7489-TP1U1804AMD64/topotests/lib/common_config.py", line 575, in load_config_to_router
    raise InvalidCLIError("%s" % output)
InvalidCLIError: line 3: % Unknown command[16]: ip ospf  dead-interval 65536


+ s=0
+ '[' 0 -eq 0 ']'
+ echo 'Topotests exit status: Success'
+ rm -f log_topotests.txt
+ '[' ALWAYS '!=' ALWAYS ']'
+ '[' 0 -eq 5 ']'
+ '[' -d /tmp/topotests ']'
+ find /tmp/topotests -iname '*.dmp' -type f -exec rm -f -- '{}' +
+ find /tmp/topotests -iname '*' -type s -exec rm -f -- '{}' +
+ '[' -s log_topotests.txt ']'
+ rm -f log_topotests.txt
+ exit 0
+ xargs kill -9
+ ps --no-headers axk comm o pid,args
+ awk '$2 ~ "/usr/lib/frr/"{print $1}'
+ exit 0