Topotest PR7489

Build: #5 failed Manual run by Martin Winter

Stages & jobs

  1. Get Sourcecode

  2. Building Stage

  3. Basic Tests

  4. Final

    Final

Build result summary

Details

Completed
Duration
178 minutes
Labels
version=frr-7_4-dev-3871-g06aa91246git=https_//github_com/frrouting/frr_gitbuildurl=https_//ci1_netdef_org/browse/testing-ttpr7489-5branch=master
Revision
1facc03e6198c8f6b950b714ac8b8d48ebf0ff3e 1facc03e6198c8f6b950b714ac8b8d48ebf0ff3e
Total tests
6558
Failing since
#1 (Manual run by Martin Winter)

Responsible

This build has been failing since #1
No one has taken responsibility

Tests

Existing test failures 2
Status Test Failing since View job Duration
AssertionError: Testcase test_BGP_GR_TC_5_1_2_p1 : Failed     Error [DUT: r1]: remoteGrMode is not correct Expected: Restart, Found: NotApplicable assert '[DUT: r1]: remoteGrMode is not correct Expected: Restart, Found: NotApplicable' is True
E   AssertionError: Testcase test_BGP_GR_TC_5_1_2_p1 : Failed 
       Error [DUT: r1]: remoteGrMode is not correct Expected: Restart, Found: NotApplicable
    assert '[DUT: r1]: remoteGrMode is not correct Expected: Restart, Found: NotApplicable' is True
AssertionError: Testcase test_BGP_GR_TC_5_1_2_p1 : Failed     Error [DUT: r1]: remoteGrMode is not correct Expected: Restart, Found: NotApplicable assert '[DUT: r1]: remoteGrMode is not correct Expected: Restart, Found: NotApplicable' is True
E   AssertionError: Testcase test_BGP_GR_TC_5_1_2_p1 : Failed 
       Error [DUT: r1]: remoteGrMode is not correct Expected: Restart, Found: NotApplicable
    assert '[DUT: r1]: remoteGrMode is not correct Expected: Restart, Found: NotApplicable' is True